program: Orca
programVersion: 5.0.2
elementType: O O O C C C C C C C C C C C C C C C C C C C H H H H H H H H H H H H H H H H H H H H H H H H H H
charge: 0
multiplicity: 1
keywords: wb97x-d3
keywords: def2-TZVPP
keywords: def2/J RIJCOSX
keywords: DEFGRID2
keywords: scfconv7
keywords: smallprint printgap noloewdin
keywords: NOSOSCF
formula: C19H26O3
InChI: InChI=1/C19H26O3/c1-7-8-13-12(4)16(10-15(13)20)22-18(21)17-14(9-11(2)3)19(17,5)6/h7,9,14,16-17H,1,8,10H2,2-6H3
48 atoms
O  0.051935 1.635877 1.259512
O  0.236635 0.533661 -0.674535
O  -3.925963 1.375061 -1.241545
C  3.236118 1.318807 -0.591625
C  3.128276 0.04722 0.177358
C  2.199696 1.226685 0.5114
C  2.835275 1.394902 -2.04418
C  4.411836 2.212411 -0.268672
C  2.621131 -1.214102 -0.411288
C  0.757995 1.087904 0.262912
C  2.366641 -2.329457 0.279853
C  -1.370987 1.503056 1.258019
C  2.509549 -2.437576 1.767569
C  1.911749 -3.580864 -0.407229
C  -2.116623 2.222406 0.137074
C  -1.847055 0.07233 1.194977
C  -2.856349 -0.075676 0.323918
C  -3.087497 1.187673 -0.384648
C  -1.232468 -0.96364 2.059329
C  -3.606821 -1.31799 -0.031951
C  -2.968064 -1.977104 -1.220133
C  -3.52453 -2.074401 -2.420703
H  3.886676 -0.086398 0.942781
H  2.442995 1.758823 1.423685
H  2.535606 2.412588 -2.301111
H  3.692026 1.14075 -2.671192
H  2.019473 0.734601 -2.321395
H  4.185926 3.255818 -0.497886
H  4.692603 2.156568 0.783935
H  5.284009 1.924546 -0.859415
H  2.483914 -1.241529 -1.487339
H  -1.651593 1.918428 2.228473
H  3.377363 -3.046542 2.031535
H  1.644038 -2.937686 2.205731
H  2.619728 -1.47539 2.262381
H  0.917207 -3.876778 -0.061735
H  2.576505 -4.419473 -0.183421
H  1.869747 -3.465396 -1.490195
H  -1.464501 2.56278 -0.66826
H  -2.657801 3.098982 0.496416
H  -1.847715 -1.859446 2.127738
H  -0.260137 -1.269179 1.662662
H  -1.056831 -0.586107 3.067918
H  -4.648499 -1.074603 -0.252455
H  -3.611618 -2.008592 0.814566
H  -1.966678 -2.367851 -1.060575
H  -3.003622 -2.541457 -3.247035
H  -4.514379 -1.682777 -2.626765
elementType: O C H
totalener: -965.42291352 hartree
nucrepener: 1894.28862095 hartree
electener: -2859.71153446 hartree
oneelecener: -5075.69840547 hartree
twoeener: 2215.98687100 hartree
cpcmener: -0.03266891 hartree
kineticenergy: 961.00692889 hartree
xcener: -95.142808971125 hartree
chargesum: 0.0000000
charge: -0.302748 -0.465297 -0.452116 0.136061 -0.044603 -0.081695 -0.297488 -0.259573 -0.237576 0.366694 -0.031851 0.303061 -0.286703 -0.231961 -0.152676 -0.008455 -0.124240 0.269407 -0.252201 -0.098799 -0.180737 -0.275215 0.110348 0.090222 0.100333 0.099929 0.094288 0.095096 0.086535 0.094892 0.120975 0.115343 0.116311 0.094056 0.094200 0.089916 0.100199 0.090753 0.111008 0.108733 0.110031 0.091027 0.117044 0.091630 0.106857 0.140429 0.127297 0.111260
qa: -0.3027 -0.4653 -0.4521 0.1361 -0.0446 -0.0817 -0.2975 -0.2596 -0.2376 0.3667 -0.0319 0.3031 -0.2867 -0.2320 -0.1527 -0.0085 -0.1242 0.2694 -0.2522 -0.0988 -0.1807 -0.2752 0.1103 0.0902 0.1003 0.0999 0.0943 0.0951 0.0865 0.0949 0.1210 0.1153 0.1163 0.0941 0.0942 0.0899 0.1002 0.0908 0.1110 0.1087 0.1100 0.0910 0.1170 0.0916 0.1069 0.1404 0.1273 0.1113
va: 2.1299 2.0268 2.0493 3.7723 3.8018 3.8607 3.8955 3.8923 3.8508 4.1129 3.7034 3.7637 3.9419 3.9276 3.8559 3.6805 3.4572 4.0968 3.9484 3.8697 3.7851 3.9518 1.0024 1.0321 0.9999 0.9989 1.0207 1.0028 1.0047 1.0022 1.0037 0.9911 0.9972 0.9959 1.0035 0.9954 0.9962 1.0078 1.0281 1.0215 1.0041 0.9981 1.0022 1.0220 1.0091 0.9989 1.0035 1.0134
dispcorr: -0.025640694 hartree
energy: -965.448554209048
dipole: 16.41070 -14.41651 1.99419 -12.05779 11.71064 -0.34715 0.92612 1.51714 2.44326
magnitude: 3.17283 au
magnitude: 8.06469 debye
