program: Orca
programVersion: 5.0.2
elementType: O O O C C C C C C C C C C C C C C C C C C C H H H H H H H H H H H H H H H H H H H H H H H H H H
charge: 0
multiplicity: 1
keywords: wb97x-d3
keywords: def2-TZVPP
keywords: def2/J RIJCOSX
keywords: DEFGRID2
keywords: scfconv7
keywords: smallprint printgap noloewdin
keywords: NOSOSCF
formula: C19H26O3
InChI: InChI=1/C19H26O3/c1-7-8-13-12(4)16(10-15(13)20)22-18(21)17-14(9-11(2)3)19(17,5)6/h7,9,14,16-17H,1,8,10H2,2-6H3
48 atoms
O  -0.107216 0.311485 0.360508
O  1.171446 -1.341917 -0.443044
O  -4.522763 0.445606 1.547011
C  3.230715 0.933427 -1.010555
C  3.551932 0.429957 0.352153
C  2.11171 0.819056 0.012539
C  3.289484 0.015166 -2.205519
C  3.635923 2.350659 -1.340835
C  3.960286 -0.972701 0.615288
C  1.054272 -0.200597 -0.065976
C  3.745883 -1.625921 1.759744
C  -1.27366 -0.51479 0.405304
C  2.988806 -1.035485 2.909956
C  4.218238 -3.033137 1.958852
C  -2.156168 -0.087943 1.569932
C  -2.121303 -0.305435 -0.827966
C  -3.375687 0.053157 -0.51181
C  -3.504343 0.17866 0.945669
C  -1.555585 -0.525507 -2.181194
C  -4.525714 0.356935 -1.416522
C  -4.63749 1.83716 -1.639788
C  -5.631248 2.596735 -1.197332
H  4.012727 1.161176 1.01221
H  1.778427 1.760209 0.43373
H  4.295019 0.036505 -2.631104
H  3.051867 -1.020883 -1.981363
H  2.600121 0.353417 -2.981902
H  2.989865 2.774642 -2.112259
H  3.58611 3.004846 -0.469253
H  4.661331 2.377422 -1.715688
H  4.494581 -1.485589 -0.179387
H  -0.982921 -1.564725 0.485872
H  2.847547 0.041031 2.825924
H  3.497051 -1.232873 3.856912
H  1.997974 -1.493013 2.992166
H  4.915904 -3.099258 2.7980
H  4.717136 -3.429865 1.074459
H  3.38257 -3.695856 2.200286
H  -1.787535 0.826987 2.039378
H  -2.231071 -0.845781 2.350682
H  -0.748607 0.181617 -2.387991
H  -1.126838 -1.526046 -2.263194
H  -2.302745 -0.40755 -2.963788
H  -5.449693 -0.025508 -0.976799
H  -4.393942 -0.151015 -2.374683
H  -3.818832 2.293285 -2.18952
H  -5.648881 3.663851 -1.379922
H  -6.461784 2.184787 -0.63556
elementType: O C H
totalener: -965.42588835 hartree
nucrepener: 1820.87297283 hartree
electener: -2786.29886118 hartree
oneelecener: -4928.29303054 hartree
twoeener: 2141.99416936 hartree
cpcmener: -0.03020351 hartree
kineticenergy: 960.99569365 hartree
xcener: -95.137566285337 hartree
chargesum: -0.0000000
charge: -0.297977 -0.464327 -0.447510 0.130325 -0.024328 -0.105211 -0.299626 -0.261974 -0.265151 0.386437 -0.019204 0.258448 -0.270867 -0.224396 -0.138347 -0.044900 -0.068666 0.280820 -0.256499 -0.102996 -0.179054 -0.273925 0.112361 0.092096 0.100681 0.097383 0.096874 0.095119 0.086826 0.093773 0.120009 0.103317 0.095257 0.104217 0.100645 0.095095 0.088447 0.093575 0.099858 0.099548 0.111343 0.116647 0.103070 0.094398 0.108709 0.139645 0.128260 0.111773
qa: -0.2980 -0.4643 -0.4475 0.1303 -0.0243 -0.1052 -0.2996 -0.2620 -0.2652 0.3864 -0.0192 0.2584 -0.2709 -0.2244 -0.1383 -0.0449 -0.0687 0.2808 -0.2565 -0.1030 -0.1791 -0.2739 0.1124 0.0921 0.1007 0.0974 0.0969 0.0951 0.0868 0.0938 0.1200 0.1033 0.0953 0.1042 0.1006 0.0951 0.0884 0.0936 0.0999 0.0995 0.1113 0.1166 0.1031 0.0944 0.1087 0.1396 0.1283 0.1118
va: 2.1168 2.0188 2.0536 3.7414 3.8354 3.8542 3.8981 3.8980 3.8553 4.0863 3.7136 3.7617 3.9467 3.9284 3.9034 3.7715 3.4329 4.0840 3.9429 3.8608 3.7926 3.9510 1.0047 1.0313 0.9987 1.0151 1.0023 1.0023 1.0051 1.0021 1.0007 1.0279 1.0044 1.0004 0.9971 0.9968 1.0072 0.9958 1.0311 1.0240 0.9980 1.0044 1.0066 1.0211 1.0055 1.0012 1.0031 1.0136
dispcorr: -0.023547862 hartree
energy: -965.449436209422
dipole: 16.81681 -15.14511 1.67170 0.09952 0.12807 0.22760 -4.49023 3.67608 -0.81414
magnitude: 1.87329 au
magnitude: 4.76151 debye
