program: Orca
programVersion: 5.0.2
elementType: O O O C C C C C C C C C C C C C C C C C C C H H H H H H H H H H H H H H H H H H H H H H H H H H
charge: 0
multiplicity: 1
keywords: wb97x-d3
keywords: def2-TZVPP
keywords: def2/J RIJCOSX
keywords: DEFGRID2
keywords: scfconv7
keywords: smallprint printgap noloewdin
keywords: NOSOSCF
formula: C19H26O3
InChI: InChI=1/C19H26O3/c1-7-8-13-12(4)16(10-15(13)20)22-18(21)17-14(9-11(2)3)19(17,5)6/h7,9,14,16-17H,1,8,10H2,2-6H3
48 atoms
O  0.049798 1.272592 1.226141
O  0.466069 0.65705 -0.882394
O  -3.901532 1.512672 -1.382303
C  3.394353 1.548221 -0.367204
C  3.320725 0.177252 0.20803
C  2.268709 1.230652 0.596443
C  3.140027 1.797859 -1.83339
C  4.450509 2.469706 0.19941
C  2.975175 -1.02242 -0.591654
C  0.870807 1.025958 0.195839
C  2.639532 -2.204515 -0.06595
C  -1.354214 1.061523 1.076853
C  2.518475 -2.443382 1.408478
C  2.366785 -3.396503 -0.930438
C  -2.086909 2.021652 0.146113
C  -1.734361 -0.315616 0.598745
C  -2.714254 -0.267513 -0.317993
C  -3.028568 1.127456 -0.62613
C  -1.104551 -1.525283 1.179518
C  -3.440584 -1.412152 -0.936505
C  -4.622756 -1.897338 -0.147699
C  -5.001213 -1.471949 1.051519
H  4.005566 -0.013509 1.028963
H  2.381974 1.638202 1.593844
H  4.084784 1.734478 -2.376392
H  2.451367 1.098476 -2.297207
H  2.743958 2.803284 -1.985542
H  5.399332 2.326626 -0.320933
H  4.160726 3.515366 0.081093
H  4.623078 2.288561 1.260944
H  3.039185 -0.939671 -1.672014
H  -1.724323 1.174895 2.09835
H  2.442974 -1.523708 1.986506
H  3.381235 -3.002359 1.781781
H  1.639172 -3.051021 1.631905
H  3.015315 -4.233711 -0.659865
H  2.515123 -3.181842 -1.988468
H  1.340104 -3.746742 -0.795374
H  -1.418888 2.535623 -0.547442
H  -2.641355 2.789627 0.686057
H  -0.156949 -1.735837 0.676818
H  -0.88071 -1.387628 2.237777
H  -1.735567 -2.405532 1.069717
H  -2.759052 -2.25392 -1.090152
H  -3.781414 -1.135777 -1.938362
H  -5.196331 -2.681814 -0.631723
H  -5.866028 -1.898724 1.542864
H  -4.472406 -0.69492 1.59064
elementType: O C H
totalener: -965.41217850 hartree
nucrepener: 1881.64905235 hartree
electener: -2847.06123085 hartree
oneelecener: -5050.15685094 hartree
twoeener: 2203.09562009 hartree
cpcmener: -0.04004121 hartree
kineticenergy: 961.00120658 hartree
xcener: -95.147020361206 hartree
chargesum: -0.0000000
charge: -0.307432 -0.492704 -0.493463 0.138282 -0.026839 -0.108056 -0.298322 -0.262701 -0.268046 0.403834 -0.019191 0.305334 -0.297602 -0.223679 -0.158689 0.023690 -0.158982 0.324028 -0.278221 -0.086621 -0.191801 -0.281980 0.114486 0.092574 0.100751 0.089789 0.103501 0.095149 0.096272 0.088074 0.128674 0.119231 0.098959 0.118543 0.094834 0.099167 0.089758 0.092821 0.113571 0.107395 0.106754 0.119801 0.113631 0.104401 0.091532 0.133549 0.133399 0.112545
qa: -0.3074 -0.4927 -0.4935 0.1383 -0.0268 -0.1081 -0.2983 -0.2627 -0.2680 0.4038 -0.0192 0.3053 -0.2976 -0.2237 -0.1587 0.0237 -0.1590 0.3240 -0.2782 -0.0866 -0.1918 -0.2820 0.1145 0.0926 0.1008 0.0898 0.1035 0.0951 0.0963 0.0881 0.1287 0.1192 0.0990 0.1185 0.0948 0.0992 0.0898 0.0928 0.1136 0.1074 0.1068 0.1198 0.1136 0.1044 0.0915 0.1335 0.1334 0.1125
va: 2.1259 2.0017 2.0028 3.7669 3.7914 3.8602 3.8949 3.8944 3.8415 4.0765 3.6876 3.7595 3.9493 3.9238 3.8842 3.6202 3.4718 4.0326 3.9403 3.8469 3.8285 3.9020 1.0024 1.0331 0.9987 1.0195 0.9994 1.0021 1.0023 1.0047 1.0003 0.9945 1.0008 0.9974 0.9949 0.9945 1.0076 0.9948 1.0256 1.0236 0.9984 1.0015 1.0027 1.0000 1.0192 1.0026 1.0037 1.0153
dispcorr: -0.025936227 hartree
energy: -965.438114729606
dipole: 15.76721 -13.58709 2.18012 -11.27081 10.24929 -1.02152 3.04731 -0.77588 2.27142
magnitude: 3.30995 au
magnitude: 8.41323 debye
