program: Gaussian 09
title: 000060703
version: EM64L-G09RevD.01
frameworkgroup: C1[X(C20H23ClFNO)]
method: RPBEPBE
basis: SDD
operation: Freq
keyword: #p
keyword: freq=noraman
keyword: PBEPBE/SDD
title: #p freq=noraman PBEPBE/SDD
converged: YES YES NO NO
title: Mulliken charges:
elementType: Cl F O N C C C C C C C C C C C C C C C C C C C C H H H H H H H H H H H H H H H H H H H H H H H
charge: -0.068973 -0.208275 -0.476061 -0.157198 -0.008410 -0.440389 -0.435346 -0.368150 -0.388270 -0.619399 -0.406649 -0.203983 0.516296 0.459902 -0.368086 -0.392689 -0.410550 -0.393322 -0.372859 -0.373525 0.312617 -0.217865 -0.207113 -0.104519 0.215500 0.222010 0.198868 0.208844 0.199306 0.226059 0.190864 0.188129 0.224393 0.211947 0.215847 0.206898 0.243201 0.211516 0.237119 0.240576 0.355289 0.233937 0.289309 0.253669 0.254921 0.252233 0.252380
chargesum: 0.00000
title: Mulliken charges with hydrogens summed into heavy atoms:
elementType: Cl F O N C C C C C C C C C C C C C C C C C C C C
charge: -0.068973 -0.208275 -0.120772 -0.157198 0.207089 -0.019511 -0.027196 0.048773 0.024252 -0.191606 0.043451 0.007533 0.516296 0.459902 -0.130967 -0.152113 -0.176612 -0.104013 -0.119190 -0.118604 0.312617 0.034368 0.045267 -0.104519
polarizability: 3.30851378e+02 2.24204425e+01 1.87294563e+02 -6.28179437e-01 1.06762574e+01 1.82131266e+02
1716.lowfreq: -2.8532 -0.0018 -0.0015 -0.0010 2.1426 12.4985 16.6211 20.0280 23.6309
frequency: 16.3395 19.6106 23.5463 32.4506 41.1485 48.5629 63.3840 83.5922 121.1862 127.9136 171.8242 180.8052 210.1541 233.6627 238.9648 277.1609 297.3090 306.4954 322.1064 350.9460 363.7044 373.3253 398.6828 408.9994 412.5900 419.2619 437.0212 461.7940 465.6438 488.7291 503.0901 543.9538 552.9537 596.6988 624.6662 630.4683 660.9446 710.2402 713.7168 734.8265 744.0332 752.4822 797.5954 804.2527 811.2069 818.1629 822.3431 831.1390 844.5907 849.5892 889.5629 898.7186 937.2143 945.9054 948.4374 957.6866 970.0029 973.5015 983.3768 999.6560 1006.5842 1023.1929 1033.4173 1042.2350 1069.1590 1072.3375 1086.8829 1102.7943 1107.6831 1117.1889 1124.7259 1131.2645 1155.2227 1160.0026 1174.0153 1186.6837 1196.6312 1202.9069 1208.4731 1216.2932 1257.9617 1261.6422 1267.8041 1274.8069 1282.9424 1291.0490 1297.5420 1305.9907 1317.4770 1321.9318 1324.1438 1343.9742 1355.3416 1363.0917 1378.2222 1382.4969 1383.8341 1390.8253 1401.3186 1406.7926 1448.6608 1450.4187 1460.2128 1468.0379 1472.3092 1476.3001 1479.3333 1495.1580 1588.2609 1601.5805 1601.9299 1612.4639 2868.5628 2874.6065 2911.0543 2929.4556 2945.7359 2970.0390 2975.3005 2980.5813 3028.1383 3034.2585 3039.2341 3040.9557 3050.5194 3051.6072 3120.8080 3128.5256 3134.1321 3157.5589 3168.1382 3172.0759 3175.0993 3176.9798 3178.0400
redmass: 7.3884 5.3445 4.1911 5.6005 4.9872 4.3887 4.7682 4.3584 5.3220 7.8174 5.2437 6.6105 3.5243 2.9333 2.0586 7.0353 5.5392 2.8584 6.0896 2.3296 4.2178 2.8145 3.5922 2.9393 2.9478 2.7506 2.8588 3.5507 4.4348 3.5005 3.5714 3.2949 2.7960 2.3058 6.9701 6.8708 4.6895 3.6688 3.1416 1.1269 4.4352 3.7911 2.2022 1.5654 1.7577 1.2765 3.3052 1.6985 1.7779 1.8160 2.5884 1.8363 1.4789 1.4541 1.4062 1.3588 2.1368 1.7095 1.3797 4.2302 2.8005 3.1520 3.7855 2.4732 2.6566 1.7051 2.0577 1.5721 1.7798 1.9856 1.7259 1.8866 1.4714 1.3119 1.1353 1.4301 1.8307 1.6555 1.8335 3.2359 1.4231 1.2469 1.3103 1.2652 1.2103 1.3272 1.3091 1.2919 1.3344 1.2867 1.3868 1.4707 1.4791 1.5456 1.7963 4.2636 4.5562 2.4779 1.5294 2.8334 1.0903 1.0978 1.0928 1.0837 1.1059 2.1939 1.1694 2.6860 7.5474 6.3355 7.5160 6.5193 1.0709 1.0700 1.0811 1.0687 1.0818 1.0601 1.0598 1.0623 1.1017 1.0898 1.0976 1.0935 1.1005 1.0942 1.0896 1.0899 1.0899 1.0889 1.0950 1.0952 1.0958 1.0733 1.0864
irintensity: 0.3729 0.6203 0.0224 0.7305 0.0315 0.8207 1.1487 1.5535 0.8458 0.7531 1.5304 0.4564 0.1053 6.0062 0.0030 4.1157 0.3817 1.9649 2.7527 0.3065 4.0726 6.3119 2.5247 0.0725 0.0128 4.3295 4.3556 2.6249 20.3844 17.2564 13.7804 19.6157 16.5216 2.7263 0.4066 0.0177 15.4660 3.6596 2.1071 60.0705 15.1049 8.7345 21.6551 10.4919 49.3023 0.6847 9.2368 4.5990 29.4698 58.0908 14.6297 3.0938 2.3919 0.7127 2.1266 0.3409 36.8338 5.9700 0.1597 49.8531 6.6285 5.4172 39.2143 34.5136 30.4454 11.8613 2.2105 44.1414 9.5722 3.8483 43.0362 11.4635 41.1492 1.7032 1.9507 14.0566 49.7268 11.5686 4.5563 4.5648 15.9132 11.7778 14.2318 3.8038 2.2730 4.3998 2.4556 26.2967 5.4456 18.6864 2.7081 2.4861 11.6656 1.6345 33.2701 1.6704 2.8228 24.0797 61.8871 2.2683 7.4930 5.3670 8.4138 4.8721 15.0814 56.4923 37.4442 115.4409 3.0282 3.6623 4.3831 11.3958 40.3534 99.4177 44.2001 62.4271 13.2685 14.0407 41.6080 39.6523 4.2377 47.7328 7.9664 54.6554 50.7979 35.4813 13.8542 12.4955 13.1947 1.5429 5.6210 5.1659 4.4008 244.7816 75.0924
temp: 298.150 k
press: 1.00000 atm
elementType: 17 9 8 7 6 6 6 6 6 6 6 6 6 6 6 6 6 6 6 6 6 6 6 6 1 1 1 1 1 1 1 1 1 1 1 1 1 1 1 1 1 1 1 1 1 1 1
symmnumber: 1
zpe: 1008098.4 jmol-1
zpe.correction: 0.383964 hartree
zpe.thermalcorrener: 0.406150 hartree
zpe.thermalcorrenthalpy: 0.407094 hartree
zpe.thermalcorrgfe: 0.328637 hartree
zpe.sumelectzpe: -1464.024752 hartree
zpe.sumelectthermal: -1464.002567 hartree
zpe.sumelectthermalent: -1464.001623 hartree
zpe.sumelectthermalfe: -1464.080080 hartree
dipole: -3.0708 1.7615 -2.3954
dipole: 4.2744
quadrupole: -203.5947 -145.8378 -146.4314
quadrupole: -9.2287 -3.2873 0.4919
quadrupole: -38.3067 19.4502 18.8566 -9.2287 -3.2873 0.4919
hfenergy: -1464.4087163 hartree
pointgroup: C01 [X(C20H23Cl1F1N1O1)]
dipole: -1.225759 -0.5763095 0.9967335 debye
polarizability: 330.6940866|-22.3413173|189.7354688|5.9322769|9.3764312|179.8476518 unknown
InChI: InChI=1S/C20H23ClFNO/c21-18-5-3-17(4-6-18)20(24)14-23-11-9-16(10-12-23)13-15-1-7-19(22)8-2-15/h1-8,16,20,24H,9-14H2
charge 0 multiplicity 1
47 atoms
Cl 8.856261 0.506366 0.425401
F  -7.77063 2.185047 -0.301267
O  2.461117 -0.717803 -1.642074
N  0.67224 -0.697189 0.329297
C  -2.245321 -1.185247 0.433129
C  -1.624681 -0.048764 -0.414063
C  -1.203188 -2.316254 0.609551
C  -0.289436 0.432074 0.184551
C  0.122214 -1.781735 1.187154
C  -3.566815 -1.733302 -0.181674
C  2.039492 -0.257368 0.709308
C  2.782327 0.22955 -0.581983
C  -4.692145 -0.709803 -0.226254
C  4.285369 0.308098 -0.364002
C  -5.377529 -0.343084 0.962822
C  -5.070383 -0.081636 -1.440804
C  4.841628 1.380328 0.377521
C  5.143464 -0.695307 -0.873704
C  -6.406851 0.623187 0.951313
C  -6.098076 0.888324 -1.480465
C  -6.7417 1.219014 -0.277055
C  6.230729 1.447372 0.626823
C  6.535922 -0.642621 -0.637646
C  7.05582 0.427448 0.114936
H  -2.481115 -0.773801 1.439523
H  -2.322095 0.806552 -0.485767
H  -1.443973 -0.417998 -1.443902
H  -1.002973 -2.78705 -0.373829
H  -1.599979 -3.103823 1.280093
H  0.163188 1.196635 -0.472189
H  -0.474823 0.912361 1.177803
H  -0.05124 -1.415129 2.229943
H  0.8711 -2.59283 1.240883
H  -3.884074 -2.611449 0.416458
H  -3.351827 -2.104948 -1.202896
H  2.043978 0.538211 1.488112
H  2.5840 -1.132527 1.107959
H  2.406882 1.242296 -0.854776
H  -5.109717 -0.825107 1.9108
H  -4.558835 -0.355622 -2.370775
H  1.554395 -1.067983 -1.355115
H  4.195323 2.180604 0.759168
H  4.705858 -1.49962 -1.471662
H  -6.942986 0.907197 1.861614
H  -6.396725 1.374156 -2.413894
H  6.661248 2.275229 1.197519
H  7.201859 -1.41345 -1.036683
