program: Orca
programVersion: 5.0.2
elementType: O O O C C C C C C C C C C C C C C C C C C C H H H H H H H H H H H H H H H H H H H H H H H H H H
charge: 0
multiplicity: 1
keywords: wb97x-d3
keywords: def2-TZVPP
keywords: def2/J RIJCOSX
keywords: DEFGRID2
keywords: scfconv7
keywords: smallprint printgap noloewdin
keywords: NOSOSCF
formula: C19H26O3
InChI: InChI=1/C19H26O3/c1-7-8-13-12(4)16(10-15(13)20)22-18(21)17-14(9-11(2)3)19(17,5)6/h7,9,14,16-17H,1,8,10H2,2-6H3
48 atoms
O  0.218742 0.772568 0.780393
O  0.907973 2.705704 1.649543
O  -3.676899 1.594477 -1.389097
C  2.927102 1.278133 -0.813647
C  2.935988 0.001094 -0.032958
C  2.515734 1.296903 0.64939
C  1.898961 1.516955 -1.892454
C  4.26003 1.91481 -1.123098
C  2.038131 -1.134957 -0.345595
C  1.152521 1.668152 1.071911
C  2.070766 -2.333029 0.24635
C  -1.144795 1.085976 1.088962
C  2.9670 -2.686219 1.393458
C  1.173284 -3.44291 -0.211365
C  -1.78593 2.021663 0.070834
C  -1.905039 -0.20798 0.971334
C  -2.893488 -0.129774 0.067877
C  -2.898483 1.203403 -0.541084
C  -1.520346 -1.380139 1.791931
C  -3.829862 -1.207304 -0.352498
C  -3.272518 -2.11767 -1.409649
C  -2.049054 -2.076251 -1.923933
H  3.925026 -0.301447 0.296494
H  3.255775 1.731109 1.312677
H  1.74959 2.588216 -2.0392
H  2.251492 1.103158 -2.839084
H  0.92503 1.076438 -1.690274
H  4.159582 2.994403 -1.249889
H  4.987937 1.737467 -0.330779
H  4.671042 1.508989 -2.049757
H  1.330669 -0.998437 -1.157556
H  -1.210003 1.47311 2.108801
H  2.376466 -3.067357 2.230543
H  3.556204 -1.848661 1.761979
H  3.657322 -3.487289 1.116343
H  1.756294 -4.306076 -0.544056
H  0.524842 -3.137922 -1.032838
H  0.53832 -3.797322 0.604923
H  -1.087144 2.338189 -0.706696
H  -2.190576 2.925274 0.528167
H  -0.579913 -1.805632 1.433318
H  -1.358173 -1.08862 2.831125
H  -2.271637 -2.167053 1.764017
H  -4.760538 -0.769222 -0.724275
H  -4.123042 -1.815003 0.50877
H  -3.964378 -2.876535 -1.761725
H  -1.743225 -2.787031 -2.680651
H  -1.306929 -1.348784 -1.615816
elementType: O C H
totalener: -965.41403820 hartree
nucrepener: 1910.26379986 hartree
electener: -2875.67783806 hartree
oneelecener: -5106.44502951 hartree
twoeener: 2230.76719145 hartree
cpcmener: -0.03920808 hartree
kineticenergy: 961.00138298 hartree
xcener: -95.144916527749 hartree
chargesum: 0.0000000
charge: -0.264242 -0.498712 -0.482456 0.120670 -0.001266 -0.113921 -0.286705 -0.262579 -0.275025 0.407896 -0.024578 0.234075 -0.267091 -0.257574 -0.157165 -0.047932 -0.090520 0.338532 -0.258752 -0.069483 -0.175263 -0.282517 0.112030 0.101136 0.106950 0.109371 0.073731 0.094556 0.088131 0.093865 0.130789 0.111613 0.095934 0.090456 0.100904 0.113254 0.091110 0.094287 0.109531 0.112699 0.094692 0.122887 0.108872 0.089550 0.105764 0.134132 0.136790 0.091572
qa: -0.2642 -0.4987 -0.4825 0.1207 -0.0013 -0.1139 -0.2867 -0.2626 -0.2750 0.4079 -0.0246 0.2341 -0.2671 -0.2576 -0.1572 -0.0479 -0.0905 0.3385 -0.2588 -0.0695 -0.1753 -0.2825 0.1120 0.1011 0.1069 0.1094 0.0737 0.0946 0.0881 0.0939 0.1308 0.1116 0.0959 0.0905 0.1009 0.1133 0.0911 0.0943 0.1095 0.1127 0.0947 0.1229 0.1089 0.0896 0.1058 0.1341 0.1368 0.0916
va: 2.1255 1.9959 2.0175 3.7927 3.7401 3.8667 3.9121 3.8953 3.8441 4.1345 3.6744 3.7431 3.9495 3.9236 3.9016 3.7372 3.4507 4.0235 3.9590 3.8323 3.8445 3.8859 1.0021 1.0253 1.0001 1.0007 1.0063 1.0024 1.0053 1.0015 0.9906 1.0187 0.9964 1.0072 0.9963 0.9982 1.0039 0.9924 1.0207 1.0215 0.9975 1.0021 1.0030 1.0195 1.0015 1.0010 1.0025 1.0235
dispcorr: -0.027618137 hartree
energy: -965.441656341781
dipole: 13.60777 -12.28958 1.31819 -15.70875 13.56230 -2.14644 -3.43711 4.38618 0.94908
magnitude: 2.69176 au
magnitude: 6.84192 debye
