program: Orca
programVersion: 5.0.2
elementType: O O O C C C C C C C C C C C C C C C C C C C H H H H H H H H H H H H H H H H H H H H H H H H H H
charge: 0
multiplicity: 1
keywords: wb97x-d3
keywords: def2-TZVPP
keywords: def2/J RIJCOSX
keywords: DEFGRID2
keywords: scfconv7
keywords: smallprint printgap noloewdin
keywords: NOSOSCF
formula: C19H26O3
InChI: InChI=1/C19H26O3/c1-7-8-13-12(4)16(10-15(13)20)22-18(21)17-14(9-11(2)3)19(17,5)6/h7,9,14,16-17H,1,8,10H2,2-6H3
48 atoms
O  -0.094764 0.188863 0.142725
O  1.243279 -0.571395 -1.486617
O  -4.263206 -1.396909 1.342675
C  3.383237 1.396802 -0.445384
C  3.437557 0.296418 0.555439
C  2.089339 0.926533 0.187976
C  3.703765 1.136606 -1.896915
C  3.837647 2.76344 0.011464
C  3.774467 -1.1021 0.185818
C  1.079522 0.109616 -0.501806
C  3.257752 -2.190104 0.762243
C  -1.213503 -0.570359 -0.322196
C  2.218541 -2.1416 1.839662
C  3.682991 -3.566468 0.352988
C  -1.892276 -1.303145 0.826956
C  -2.264917 0.360362 -0.866306
C  -3.467929 0.128827 -0.317385
C  -3.34729 -0.917746 0.701957
C  -1.914611 1.368447 -1.893438
C  -4.755055 0.824194 -0.594744
C  -4.959452 2.074138 0.213651
C  -4.076868 2.638444 1.029034
H  3.761265 0.590362 1.550828
H  1.673855 1.580306 0.945664
H  3.134459 1.80601 -2.543927
H  4.762231 1.339561 -2.069735
H  3.512851 0.118081 -2.220948
H  4.919491 2.860471 -0.096613
H  3.372467 3.549894 -0.585699
H  3.590232 2.947427 1.057481
H  4.520175 -1.234605 -0.592983
H  -0.896627 -1.264033 -1.102912
H  1.291581 -2.614213 1.502512
H  1.981438 -1.131593 2.168659
H  2.548877 -2.707202 2.714607
H  4.412741 -3.548238 -0.456113
H  2.825186 -4.157764 0.02317
H  4.123886 -4.106863 1.19447
H  -1.516673 -0.960004 1.793903
H  -1.762049 -2.384755 0.789547
H  -1.292675 2.154471 -1.45875
H  -1.332541 0.917034 -2.699029
H  -2.795512 1.84211 -2.322698
H  -5.59073 0.144976 -0.402881
H  -4.831415 1.081129 -1.655476
H  -5.931963 2.539619 0.087542
H  -4.31854 3.548245 1.563218
H  -3.089709 2.225592 1.199249
elementType: O C H
totalener: -965.41431106 hartree
nucrepener: 1843.36150378 hartree
electener: -2808.77581484 hartree
oneelecener: -4973.14496357 hartree
twoeener: 2164.36914873 hartree
cpcmener: -0.03725123 hartree
kineticenergy: 961.00020554 hartree
xcener: -95.143561475514 hartree
chargesum: -0.0000000
charge: -0.303569 -0.490121 -0.484914 0.138755 -0.006222 -0.118390 -0.300653 -0.268028 -0.300466 0.401983 -0.003741 0.268650 -0.273788 -0.223697 -0.148805 -0.038613 -0.105525 0.329039 -0.250424 -0.074774 -0.188984 -0.280141 0.113446 0.097179 0.102664 0.098731 0.093700 0.094921 0.095336 0.088649 0.123148 0.108232 0.099825 0.094016 0.111506 0.090264 0.094968 0.096687 0.102716 0.103176 0.113970 0.119054 0.106872 0.090758 0.105374 0.133459 0.133528 0.110247
qa: -0.3036 -0.4901 -0.4849 0.1388 -0.0062 -0.1184 -0.3007 -0.2680 -0.3005 0.4020 -0.0037 0.2686 -0.2738 -0.2237 -0.1488 -0.0386 -0.1055 0.3290 -0.2504 -0.0748 -0.1890 -0.2801 0.1134 0.0972 0.1027 0.0987 0.0937 0.0949 0.0953 0.0886 0.1231 0.1082 0.0998 0.0940 0.1115 0.0903 0.0950 0.0967 0.1027 0.1032 0.1140 0.1191 0.1069 0.0908 0.1054 0.1335 0.1335 0.1102
va: 2.1035 1.9952 2.0130 3.7351 3.8182 3.8237 3.8923 3.9020 3.8725 4.0845 3.6808 3.7228 3.9466 3.9229 3.8951 3.7331 3.4718 4.0394 3.9343 3.8319 3.8381 3.8968 1.0057 1.0307 1.0003 0.9988 1.0142 1.0018 1.0022 1.0043 1.0017 1.0352 0.9959 1.0077 0.9990 1.0066 0.9971 0.9965 1.0265 1.0233 0.9994 1.0048 1.0025 1.0197 1.0003 1.0021 1.0039 1.0200
dispcorr: -0.024665592 hartree
energy: -965.438976648589
dipole: 16.10973 -14.74372 1.36602 4.50773 -3.20716 1.30057 -1.21774 0.75068 -0.46706
magnitude: 1.94310 au
magnitude: 4.93896 debye
