program: Orca
programVersion: 5.0.2
elementType: O O O C C C C C C C C C C C C C C C C C C C H H H H H H H H H H H H H H H H H H H H H H H H H H
charge: 0
multiplicity: 1
keywords: wb97x-d3
keywords: def2-TZVPP
keywords: def2/J RIJCOSX
keywords: DEFGRID2
keywords: scfconv7
keywords: smallprint printgap noloewdin
keywords: NOSOSCF
formula: C19H26O3
InChI: InChI=1/C19H26O3/c1-7-8-13-12(4)16(10-15(13)20)22-18(21)17-14(9-11(2)3)19(17,5)6/h7,9,14,16-17H,1,8,10H2,2-6H3
48 atoms
O  -0.136792 0.194232 0.162443
O  1.197248 -0.862901 -1.29782
O  -4.355964 -1.061212 1.559344
C  3.327967 1.2857 -0.579884
C  3.453384 0.268971 0.497358
C  2.072496 0.84198 0.148303
C  3.581669 0.91796 -2.02064
C  3.763423 2.695512 -0.253655
C  3.803838 -1.147677 0.234185
C  1.044853 -0.032886 -0.431727
C  3.455349 -2.155739 1.037661
C  -1.276956 -0.59203 -0.189422
C  2.601162 -1.947968 2.254367
C  3.856884 -3.567959 0.748097
C  -1.983275 -1.111081 1.054911
C  -2.300299 0.264902 -0.886898
C  -3.515469 0.145162 -0.328017
C  -3.427073 -0.717788 0.853397
C  -1.921651 1.089904 -2.057079
C  -4.788703 0.785512 -0.762769
C  -4.975224 2.196857 -0.285315
C  -4.10308 2.921351 0.404683
H  3.803462 0.645455 1.455589
H  1.680574 1.552047 0.866722
H  2.990262 1.546893 -2.688107
H  4.633161 1.093195 -2.254813
H  3.364588 -0.118184 -2.261838
H  3.223309 3.421516 -0.864219
H  3.588528 2.944667 0.793592
H  4.829311 2.822052 -0.451779
H  4.396562 -1.362459 -0.649738
H  -0.97868 -1.41052 -0.847521
H  2.740509 -2.749141 2.980741
H  1.539891 -1.942598 1.987957
H  2.807371 -1.002471 2.75672
H  4.453684 -3.649545 -0.159998
H  2.977893 -4.208003 0.635041
H  4.436456 -3.985834 1.575088
H  -1.605701 -0.62088 1.955433
H  -1.87951 -2.186604 1.198083
H  -1.281347 1.91818 -1.744221
H  -1.348505 0.505218 -2.77893
H  -2.789124 1.513304 -2.559833
H  -5.637145 0.187076 -0.418549
H  -4.860144 0.779579 -1.854464
H  -5.928387 2.640127 -0.556783
H  -4.334301 3.938768 0.692789
H  -3.134219 2.54074 0.70534
elementType: O C H
totalener: -965.41398675 hartree
nucrepener: 1832.39581886 hartree
electener: -2797.80980561 hartree
oneelecener: -4951.20684803 hartree
twoeener: 2153.39704242 hartree
cpcmener: -0.03729351 hartree
kineticenergy: 960.99717211 hartree
xcener: -95.142455508156 hartree
chargesum: 0.0000000
charge: -0.306917 -0.494857 -0.485673 0.129667 -0.021112 -0.092843 -0.295945 -0.264133 -0.284405 0.399612 -0.009052 0.267219 -0.282141 -0.222561 -0.151727 -0.040602 -0.100794 0.335302 -0.252688 -0.073522 -0.191332 -0.280873 0.113571 0.091701 0.101622 0.100569 0.091438 0.096290 0.087987 0.094375 0.126837 0.107714 0.103734 0.102759 0.100977 0.087735 0.098862 0.095249 0.101527 0.101824 0.114766 0.119254 0.106362 0.090391 0.105504 0.134193 0.133098 0.111035
qa: -0.3069 -0.4949 -0.4857 0.1297 -0.0211 -0.0928 -0.2959 -0.2641 -0.2844 0.3996 -0.0091 0.2672 -0.2821 -0.2226 -0.1517 -0.0406 -0.1008 0.3353 -0.2527 -0.0735 -0.1913 -0.2809 0.1136 0.0917 0.1016 0.1006 0.0914 0.0963 0.0880 0.0944 0.1268 0.1077 0.1037 0.1028 0.1010 0.0877 0.0989 0.0952 0.1015 0.1018 0.1148 0.1193 0.1064 0.0904 0.1055 0.1342 0.1331 0.1110
va: 2.1074 1.9913 2.0129 3.7636 3.8078 3.8449 3.8950 3.8979 3.8309 4.0737 3.6935 3.7340 3.9560 3.9250 3.9048 3.7344 3.4566 4.0228 3.9347 3.8304 3.8384 3.8978 1.0040 1.0334 1.0003 0.9986 1.0158 1.0024 1.0047 1.0022 0.9991 1.0343 1.0034 0.9952 0.9991 1.0075 0.9941 0.9960 1.0273 1.0237 0.9990 1.0051 1.0025 1.0211 0.9992 1.0019 1.0041 1.0188
dispcorr: -0.024078947 hartree
energy: -965.438065696145
dipole: 16.77519 -15.34231 1.43289 4.25622 -3.08644 1.16978 -2.12723 1.45702 -0.67021
magnitude: 1.96741 au
magnitude: 5.00077 debye
