program: Orca
programVersion: 5.0.2
elementType: O O O C C C C C C C C C C C C C C C C C C C H H H H H H H H H H H H H H H H H H H H H H H H H H
charge: 0
multiplicity: 1
keywords: wb97x-d3
keywords: def2-TZVPP
keywords: def2/J RIJCOSX
keywords: DEFGRID2
keywords: scfconv7
keywords: smallprint printgap noloewdin
keywords: NOSOSCF
formula: C19H26O3
InChI: InChI=1/C19H26O3/c1-7-8-13-12(4)16(10-15(13)20)22-18(21)17-14(9-11(2)3)19(17,5)6/h7,9,14,16-17H,1,8,10H2,2-6H3
48 atoms
O  0.357857 1.118123 0.346923
O  0.961167 1.949776 2.331836
O  -3.389475 0.418578 -1.957096
C  3.407783 1.391388 -0.246306
C  3.029037 -0.042082 -0.091499
C  2.619993 0.962087 0.982646
C  2.765697 2.238415 -1.316967
C  4.843778 1.773631 0.020274
C  2.102497 -0.718848 -1.035454
C  1.246028 1.39465 1.290719
C  1.38091 -1.810686 -0.772651
C  -1.02595 1.448381 0.52967
C  1.33012 -2.463583 0.57329
C  0.543322 -2.459433 -1.83145
C  -1.655991 1.692754 -0.834351
C  -1.759918 0.252976 1.092168
C  -2.69959 -0.199159 0.246219
C  -2.683807 0.598503 -0.984109
C  -1.421897 -0.296415 2.426683
C  -3.616181 -1.367328 0.422934
C  -2.950839 -2.638608 -0.014339
C  -3.362403 -3.402527 -1.018427
H  3.829938 -0.682683 0.269641
H  3.213516 0.921918 1.888867
H  3.340613 2.157039 -2.24138
H  1.739904 1.963495 -1.549396
H  2.769438 3.289569 -1.023408
H  4.919753 2.812799 0.345692
H  5.293283 1.147631 0.791843
H  5.441878 1.664897 -0.886587
H  2.059245 -0.311155 -2.041562
H  -1.123247 2.311943 1.18984
H  0.294404 -2.581639 0.903569
H  1.866685 -1.906985 1.340128
H  1.752742 -3.471152 0.532691
H  0.644913 -1.963671 -2.796672
H  -0.514523 -2.447827 -1.555642
H  0.815535 -3.5102 -1.960601
H  -0.927159 1.651627 -1.645542
H  -2.145265 2.666466 -0.890966
H  -1.429896 0.489447 3.18348
H  -2.115032 -1.077482 2.732912
H  -0.419027 -0.729655 2.428821
H  -4.533307 -1.20932 -0.147866
H  -3.905574 -1.450932 1.473623
H  -2.061538 -2.920739 0.543287
H  -2.834382 -4.307787 -1.289716
H  -4.240587 -3.154614 -1.603377
elementType: O C H
totalener: -965.41135412 hartree
nucrepener: 1923.62111652 hartree
electener: -2889.03247064 hartree
oneelecener: -5133.33495063 hartree
twoeener: 2244.30248000 hartree
cpcmener: -0.03789851 hartree
kineticenergy: 961.00587248 hartree
xcener: -95.143853964369 hartree
chargesum: -0.0000000
charge: -0.261624 -0.504474 -0.483062 0.135201 -0.004656 -0.171208 -0.290233 -0.267968 -0.248906 0.442776 -0.035291 0.211418 -0.286516 -0.211627 -0.143554 -0.028519 -0.074058 0.305239 -0.262657 -0.082301 -0.215469 -0.278519 0.116275 0.096781 0.101958 0.086490 0.102696 0.095279 0.088224 0.093965 0.126566 0.112913 0.080537 0.100947 0.116483 0.092797 0.067266 0.101022 0.101897 0.112414 0.124384 0.107492 0.115134 0.091329 0.113794 0.161266 0.132686 0.115413
qa: -0.2616 -0.5045 -0.4831 0.1352 -0.0047 -0.1712 -0.2902 -0.2680 -0.2489 0.4428 -0.0353 0.2114 -0.2865 -0.2116 -0.1436 -0.0285 -0.0741 0.3052 -0.2627 -0.0823 -0.2155 -0.2785 0.1163 0.0968 0.1020 0.0865 0.1027 0.0953 0.0882 0.0940 0.1266 0.1129 0.0805 0.1009 0.1165 0.0928 0.0673 0.1010 0.1019 0.1124 0.1244 0.1075 0.1151 0.0913 0.1138 0.1613 0.1327 0.1154
va: 2.1121 1.9906 2.0099 3.7391 3.7748 3.9121 3.9150 3.9032 3.8338 4.0737 3.6788 3.7664 3.9531 3.9198 3.9154 3.7040 3.4270 4.0452 3.9301 3.8439 3.7990 3.9403 1.0023 1.0278 0.9989 1.0064 1.0015 1.0018 1.0053 1.0016 0.9969 1.0273 0.9988 1.0023 1.0017 1.0099 1.0039 0.9989 1.0288 1.0188 1.0056 1.0048 0.9945 1.0254 1.0034 0.9852 1.0033 1.0121
dispcorr: -0.028438991 hartree
energy: -965.439793110549
dipole: 10.66645 -9.42068 1.24577 -10.04052 9.56824 -0.47227 -2.09845 2.89154 0.79309
magnitude: 1.55048 au
magnitude: 3.94101 debye
