program: Orca
programVersion: 5.0.2
elementType: O O O C C C C C C C C C C C C C C C C C C C H H H H H H H H H H H H H H H H H H H H H H H H H H
charge: 0
multiplicity: 1
keywords: wb97x-d3
keywords: def2-TZVPP
keywords: def2/J RIJCOSX
keywords: DEFGRID2
keywords: scfconv7
keywords: smallprint printgap noloewdin
keywords: NOSOSCF
formula: C19H26O3
InChI: InChI=1/C19H26O3/c1-7-8-13-12(4)16(10-15(13)20)22-18(21)17-14(9-11(2)3)19(17,5)6/h7,9,14,16-17H,1,8,10H2,2-6H3
48 atoms
O  -0.004735 0.719308 0.217326
O  1.310448 0.144616 -1.490449
O  -3.406241 -2.383696 -0.284177
C  3.599433 1.524155 0.11822
C  3.556134 0.131389 0.637604
C  2.264359 0.952178 0.56291
C  3.894399 1.796807 -1.335673
C  4.152016 2.589843 1.035982
C  3.796944 -1.052909 -0.224185
C  1.191279 0.565146 -0.361742
C  3.239121 -2.253042 -0.046385
C  -1.161591 0.384931 -0.552453
C  2.234334 -2.544343 1.024709
C  3.578298 -3.409876 -0.934839
C  -1.384759 -1.113477 -0.721778
C  -2.364258 0.87694 0.209127
C  -3.279077 -0.091018 0.37877
C  -2.787547 -1.339032 -0.211362
C  -2.466288 2.298883 0.611497
C  -4.636403 0.033706 0.997121
C  -5.625045 0.5906 0.015521
C  -6.286106 1.729407 0.182769
H  3.88767 0.013455 1.666199
H  1.902719 1.318603 1.51613
H  3.401053 2.714139 -1.661393
H  4.969039 1.941825 -1.462047
H  3.59426 0.999874 -2.009893
H  3.727348 3.567246 0.79988
H  3.937281 2.376443 2.083651
H  5.235756 2.662788 0.926756
H  4.507083 -0.930589 -1.037039
H  -1.11321 0.895039 -1.519336
H  2.012245 -1.684122 1.65372
H  2.583732 -3.35254 1.673044
H  1.294354 -2.89044 0.58447
H  2.6847 -3.79309 -1.4341
H  3.988987 -4.241529 -0.35656
H  4.304479 -3.140413 -1.701356
H  -0.686197 -1.701309 -0.119627
H  -1.28802 -1.449404 -1.754044
H  -2.464289 2.936884 -0.275999
H  -3.372299 2.506734 1.176386
H  -1.608621 2.601861 1.214093
H  -4.592654 0.670403 1.882761
H  -4.968216 -0.952853 1.331925
H  -5.780908 0.007036 -0.887235
H  -6.986169 2.090727 -0.559719
H  -6.156414 2.339182 1.069727
elementType: O C H
totalener: -965.41573222 hartree
nucrepener: 1825.00005020 hartree
electener: -2790.41578242 hartree
oneelecener: -4936.55337527 hartree
twoeener: 2146.13759284 hartree
cpcmener: -0.03708350 hartree
kineticenergy: 960.99746564 hartree
xcener: -95.140791422113 hartree
chargesum: -0.0000000
charge: -0.300040 -0.493368 -0.488911 0.129209 -0.012911 -0.076259 -0.298151 -0.265508 -0.288959 0.375096 -0.008427 0.254244 -0.280997 -0.224307 -0.138849 -0.057865 -0.065268 0.327613 -0.250331 -0.104374 -0.181424 -0.289449 0.116520 0.095972 0.102552 0.099891 0.093236 0.096465 0.087825 0.094306 0.123840 0.106530 0.095402 0.115906 0.097062 0.095763 0.096524 0.089223 0.105020 0.105365 0.116809 0.094966 0.113682 0.105775 0.096705 0.145351 0.132195 0.116349
qa: -0.3000 -0.4934 -0.4889 0.1292 -0.0129 -0.0763 -0.2982 -0.2655 -0.2890 0.3751 -0.0084 0.2542 -0.2810 -0.2243 -0.1388 -0.0579 -0.0653 0.3276 -0.2503 -0.1044 -0.1814 -0.2894 0.1165 0.0960 0.1026 0.0999 0.0932 0.0965 0.0878 0.0943 0.1238 0.1065 0.0954 0.1159 0.0971 0.0958 0.0965 0.0892 0.1050 0.1054 0.1168 0.0950 0.1137 0.1058 0.0967 0.1454 0.1322 0.1163
va: 2.1158 1.9921 2.0083 3.7400 3.8200 3.8324 3.8962 3.9007 3.8631 4.0740 3.6812 3.7731 3.9426 3.9237 3.8833 3.7896 3.4474 4.0344 3.9448 3.8596 3.7860 3.9415 1.0045 1.0289 1.0003 0.9983 1.0150 1.0019 1.0047 1.0021 1.0005 1.0158 1.0064 0.9991 0.9955 0.9970 0.9961 1.0069 1.0292 1.0246 0.9960 1.0061 1.0094 1.0043 1.0236 1.0036 1.0033 1.0085
dispcorr: -0.023895239 hartree
energy: -965.439627456282
dipole: 12.36305 -11.40029 0.96276 5.03827 -2.89245 2.14582 3.04442 -1.81572 1.22870
magnitude: 2.65352 au
magnitude: 6.74470 debye
