program: Orca
programVersion: 5.0.2
elementType: O O O C C C C C C C C C C C C C C C C C C C H H H H H H H H H H H H H H H H H H H H H H H H H H
charge: 0
multiplicity: 1
keywords: wb97x-d3
keywords: def2-TZVPP
keywords: def2/J RIJCOSX
keywords: DEFGRID2
keywords: scfconv7
keywords: smallprint printgap noloewdin
keywords: NOSOSCF
formula: C19H26O3
InChI: InChI=1/C19H26O3/c1-7-8-13-12(4)16(10-15(13)20)22-18(21)17-14(9-11(2)3)19(17,5)6/h7,9,14,16-17H,1,8,10H2,2-6H3
48 atoms
O  -0.286959 0.606554 0.270582
O  1.08358 0.716776 -1.484293
O  -4.080085 -1.270271 -1.595536
C  3.30399 1.047941 0.713123
C  3.256165 -0.418619 0.429135
C  1.958672 0.342628 0.726323
C  3.660681 2.045603 -0.360456
C  3.806456 1.461332 2.076282
C  3.56621 -0.997942 -0.890855
C  0.924744 0.57266 -0.292839
C  4.093482 -2.207801 -1.115767
C  -1.40683 0.875015 -0.576434
C  4.438823 -3.218849 -0.065634
C  4.383663 -2.657477 -2.516873
C  -1.853802 -0.315993 -1.415638
C  -2.577142 1.189132 0.315487
C  -3.659959 0.465525 -0.009841
C  -3.316026 -0.479906 -1.075074
C  -2.455484 2.214118 1.378258
C  -5.018631 0.518675 0.612055
C  -5.104128 -0.410825 1.786618
C  -5.326256 -0.021235 3.035834
H  3.539348 -1.038765 1.27186
H  1.552387 0.164572 1.714712
H  3.368957 1.755813 -1.365326
H  3.200244 3.012029 -0.147798
H  4.741999 2.194186 -0.36669
H  3.534426 0.739405 2.846874
H  4.894592 1.548558 2.070795
H  3.396244 2.430589 2.365688
H  3.372272 -0.381741 -1.760037
H  -1.18709 1.747168 -1.199531
H  5.479789 -3.535649 -0.170369
H  3.831967 -4.119829 -0.190175
H  4.301942 -2.86828 0.955377
H  3.862209 -3.590772 -2.744867
H  5.449423 -2.860778 -2.650825
H  4.086223 -1.916081 -3.258218
H  -1.317083 -1.227923 -1.142918
H  -1.718632 -0.165281 -2.486703
H  -1.878614 1.82337 2.219705
H  -1.922995 3.093625 1.012651
H  -3.424435 2.527704 1.761634
H  -5.765059 0.235301 -0.135221
H  -5.253392 1.537216 0.925618
H  -4.955411 -1.465176 1.572429
H  -5.36366 -0.733097 3.850435
H  -5.471492 1.022131 3.291648
elementType: O C H
totalener: -965.41658490 hartree
nucrepener: 1784.24201818 hartree
electener: -2749.65860308 hartree
oneelecener: -4855.00886677 hartree
twoeener: 2105.35026369 hartree
cpcmener: -0.03638824 hartree
kineticenergy: 960.99573154 hartree
xcener: -95.140844235916 hartree
chargesum: 0.0000000
charge: -0.301221 -0.500598 -0.488608 0.098263 0.028780 -0.072412 -0.283160 -0.263145 -0.292814 0.406051 -0.059988 0.251712 -0.255035 -0.217804 -0.147074 -0.047452 -0.053552 0.322060 -0.270628 -0.105937 -0.178358 -0.289567 0.121205 0.097030 0.093716 0.102816 0.099624 0.088049 0.095706 0.094002 0.120835 0.107363 0.095272 0.098582 0.089216 0.092693 0.094138 0.088079 0.106495 0.104535 0.114797 0.119587 0.100496 0.098035 0.105984 0.144023 0.132490 0.115718
qa: -0.3012 -0.5006 -0.4886 0.0983 0.0288 -0.0724 -0.2832 -0.2631 -0.2928 0.4061 -0.0600 0.2517 -0.2550 -0.2178 -0.1471 -0.0475 -0.0536 0.3221 -0.2706 -0.1059 -0.1784 -0.2896 0.1212 0.0970 0.0937 0.1028 0.0996 0.0880 0.0957 0.0940 0.1208 0.1074 0.0953 0.0986 0.0892 0.0927 0.0941 0.0881 0.1065 0.1045 0.1148 0.1196 0.1005 0.0980 0.1060 0.1440 0.1325 0.1157
va: 2.1294 1.9936 2.0055 3.7256 3.7293 3.8521 3.9017 3.9085 3.8444 4.0661 3.7953 3.7686 3.9383 3.9203 3.9065 3.7693 3.4437 4.0342 3.9490 3.8576 3.7880 3.9465 1.0008 1.0286 1.0151 0.9986 0.9999 1.0053 1.0014 1.0026 1.0215 1.0150 0.9968 0.9964 1.0137 0.9964 0.9962 1.0091 1.0235 1.0236 0.9997 1.0006 1.0051 1.0216 1.0049 1.0043 1.0027 1.0091
dispcorr: -0.021837510 hartree
energy: -965.438422406092
dipole: 19.03836 -17.64200 1.39636 -0.13311 1.50300 1.36989 7.97770 -5.91679 2.06091
magnitude: 2.84144 au
magnitude: 7.22237 debye
