program: Orca
programVersion: 5.0.2
elementType: O O O C C C C C C C C C C C C C C C C C C C H H H H H H H H H H H H H H H H H H H H H H H H H H
charge: 0
multiplicity: 1
keywords: wb97x-d3
keywords: def2-TZVPP
keywords: def2/J RIJCOSX
keywords: DEFGRID2
keywords: scfconv7
keywords: smallprint printgap noloewdin
keywords: NOSOSCF
formula: C19H26O3
InChI: InChI=1/C19H26O3/c1-7-8-13-12(4)16(10-15(13)20)22-18(21)17-14(9-11(2)3)19(17,5)6/h7,9,14,16-17H,1,8,10H2,2-6H3
48 atoms
O  -0.021227 1.314618 1.236177
O  0.362183 0.657119 -0.864316
O  -3.914062 1.542859 -1.435747
C  3.324074 1.436068 -0.377912
C  3.226888 0.098683 0.284635
C  2.192756 1.195317 0.597892
C  3.086149 1.602848 -1.858769
C  4.39769 2.366823 0.138564
C  2.859642 -1.13912 -0.426806
C  0.785658 1.024823 0.207202
C  3.214187 -2.382048 -0.077741
C  -1.430816 1.132885 1.09659
C  4.038734 -2.747594 1.118305
C  2.776981 -3.555245 -0.903396
C  -2.139348 2.075291 0.129686
C  -1.840333 -0.254603 0.669985
C  -2.801177 -0.218613 -0.267116
C  -3.07183 1.171235 -0.639594
C  -1.262418 -1.446127 1.335113
C  -3.559639 -1.3561 -0.858274
C  -4.856974 -1.654565 -0.164379
C  -5.300114 -1.092912 0.953871
H  3.911305 -0.039217 1.113693
H  2.316834 1.652704 1.572252
H  2.401164 0.881801 -2.293173
H  2.697219 2.599895 -2.072375
H  4.037496 1.505131 -2.38477
H  4.564157 2.24404 1.209371
H  5.344803 2.176847 -0.369652
H  4.127611 3.409252 -0.040386
H  2.256976 -1.036423 -1.321223
H  -1.796539 1.292795 2.113196
H  4.423701 -1.894163 1.672019
H  4.891535 -3.36188 0.819741
H  3.452356 -3.354681 1.812811
H  3.63911 -4.100266 -1.296605
H  2.152882 -3.258023 -1.745772
H  2.212145 -4.269479 -0.298738
H  -1.458403 2.577689 -0.55924
H  -2.7028 2.853897 0.645016
H  -1.299671 -1.33332 2.420212
H  -1.786228 -2.36102 1.066672
H  -0.209889 -1.575493 1.069409
H  -2.94944 -2.263473 -0.862582
H  -3.769712 -1.149754 -1.912001
H  -5.46443 -2.413835 -0.647089
H  -6.250497 -1.384649 1.381704
H  -4.743726 -0.330985 1.486762
elementType: O C H
totalener: -965.41321543 hartree
nucrepener: 1850.93599702 hartree
electener: -2816.34921245 hartree
oneelecener: -4988.81991531 hartree
twoeener: 2172.47070286 hartree
cpcmener: -0.03949755 hartree
kineticenergy: 960.99732976 hartree
xcener: -95.146561166158 hartree
chargesum: -0.0000000
charge: -0.306937 -0.493950 -0.490454 0.106034 0.038934 -0.100610 -0.285548 -0.263371 -0.312199 0.406970 -0.054268 0.298394 -0.255134 -0.220357 -0.152788 0.019428 -0.165542 0.318047 -0.251418 -0.092274 -0.186402 -0.282172 0.120305 0.094558 0.094887 0.102667 0.096858 0.088128 0.095857 0.094823 0.122071 0.121298 0.089854 0.096446 0.098514 0.097551 0.089082 0.092871 0.113369 0.108828 0.115300 0.103281 0.113941 0.101934 0.094066 0.134030 0.133882 0.111217
qa: -0.3069 -0.4940 -0.4905 0.1060 0.0389 -0.1006 -0.2855 -0.2634 -0.3122 0.4070 -0.0543 0.2984 -0.2551 -0.2204 -0.1528 0.0194 -0.1655 0.3180 -0.2514 -0.0923 -0.1864 -0.2822 0.1203 0.0946 0.0949 0.1027 0.0969 0.0881 0.0959 0.0948 0.1221 0.1213 0.0899 0.0964 0.0985 0.0976 0.0891 0.0929 0.1134 0.1088 0.1153 0.1033 0.1139 0.1019 0.0941 0.1340 0.1339 0.1112
va: 2.1267 2.0085 2.0052 3.7359 3.7162 3.8448 3.8959 3.9039 3.8646 4.0866 3.7897 3.7576 3.9385 3.9179 3.8789 3.6317 3.4849 4.0413 3.9504 3.8463 3.8240 3.9026 0.9993 1.0323 1.0154 0.9986 1.0003 1.0054 1.0018 1.0022 1.0184 0.9930 1.0136 0.9971 0.9966 0.9966 1.0089 0.9962 1.0258 1.0229 0.9992 1.0023 0.9965 1.0027 1.0158 1.0022 1.0033 1.0156
dispcorr: -0.024034566 hartree
energy: -965.437249993259
dipole: 18.16631 -15.94851 2.21780 -11.93866 10.96080 -0.97785 2.63972 -0.30893 2.33080
magnitude: 3.36266 au
magnitude: 8.54719 debye
