program: Orca
programVersion: 5.0.2
elementType: O O O C C C C C C C C C C C C C C C C C C C H H H H H H H H H H H H H H H H H H H H H H H H H H
charge: 0
multiplicity: 1
keywords: wb97x-d3
keywords: def2-TZVPP
keywords: def2/J RIJCOSX
keywords: DEFGRID2
keywords: scfconv7
keywords: smallprint printgap noloewdin
keywords: NOSOSCF
formula: C19H26O3
InChI: InChI=1/C19H26O3/c1-7-8-13-12(4)16(10-15(13)20)22-18(21)17-14(9-11(2)3)19(17,5)6/h7,9,14,16-17H,1,8,10H2,2-6H3
48 atoms
O  -0.182614 0.669387 0.010686
O  1.229976 0.040742 -1.602238
O  -3.968254 -1.87296 -0.493711
C  3.368255 1.333307 0.33838
C  3.380001 -0.134197 0.583865
C  2.049178 0.616715 0.583604
C  3.706832 1.880972 -1.025013
C  3.80909 2.236904 1.465365
C  3.771637 -1.111466 -0.463297
C  1.041308 0.404797 -0.463912
C  3.351271 -2.376784 -0.528849
C  -1.300381 0.483699 -0.860526
C  2.349456 -2.959115 0.418271
C  3.86059 -3.314714 -1.580412
C  -1.761108 -0.966712 -0.948274
C  -2.46017 1.229073 -0.257353
C  -3.536661 0.443197 -0.102232
C  -3.205527 -0.926219 -0.506054
C  -2.335016 2.665998 0.08075
C  -4.875506 0.816899 0.431868
C  -4.984338 0.762523 1.928529
C  -4.003759 0.501833 2.784102
H  3.660194 -0.427431 1.592352
H  1.620084 0.787969 1.563563
H  3.198931 2.832224 -1.192936
H  4.780349 2.069838 -1.083136
H  3.449521 1.217821 -1.846559
H  4.889362 2.39071 1.432305
H  3.331888 3.215876 1.392619
H  3.563342 1.816415 2.441194
H  4.492129 -0.771062 -1.201593
H  -1.07313 0.899836 -1.845879
H  1.509099 -3.392117 -0.13063
H  1.950096 -2.231591 1.122691
H  2.791915 -3.77558 0.995234
H  4.597665 -2.842615 -2.229642
H  3.043603 -3.682998 -2.206032
H  4.32368 -4.195544 -1.128529
H  -1.191858 -1.615133 -0.277674
H  -1.677747 -1.384186 -1.95197
H  -1.728638 2.793961 0.980269
H  -1.833256 3.213532 -0.718722
H  -3.30249 3.12864 0.266655
H  -5.638715 0.160334 0.004018
H  -5.147268 1.824393 0.102876
H  -5.977588 0.96877 2.315196
H  -4.187863 0.497688 3.850757
H  -2.988869 0.293258 2.46701
elementType: O C H
totalener: -965.41595041 hartree
nucrepener: 1830.93116521 hartree
electener: -2796.34711562 hartree
oneelecener: -4948.54089491 hartree
twoeener: 2152.19377929 hartree
cpcmener: -0.03877138 hartree
kineticenergy: 961.00037805 hartree
xcener: -95.142270541695 hartree
chargesum: 0.0000000
charge: -0.304331 -0.496246 -0.483382 0.128174 -0.012807 -0.089673 -0.297404 -0.264661 -0.283353 0.393424 -0.017956 0.261832 -0.273340 -0.225359 -0.147043 -0.037621 -0.098247 0.330823 -0.269034 -0.072056 -0.188827 -0.280148 0.117049 0.096604 0.102870 0.102257 0.093186 0.094369 0.095960 0.088266 0.124933 0.109615 0.096676 0.093060 0.110467 0.090271 0.095748 0.095138 0.104179 0.105894 0.113179 0.119532 0.104670 0.090246 0.105855 0.134022 0.133606 0.109581
qa: -0.3043 -0.4962 -0.4834 0.1282 -0.0128 -0.0897 -0.2974 -0.2647 -0.2834 0.3934 -0.0180 0.2618 -0.2733 -0.2254 -0.1470 -0.0376 -0.0982 0.3308 -0.2690 -0.0721 -0.1888 -0.2801 0.1170 0.0966 0.1029 0.1023 0.0932 0.0944 0.0960 0.0883 0.1249 0.1096 0.0967 0.0931 0.1105 0.0903 0.0957 0.0951 0.1042 0.1059 0.1132 0.1195 0.1047 0.0902 0.1059 0.1340 0.1336 0.1096
va: 2.1176 1.9869 2.0157 3.7436 3.8204 3.8529 3.9023 3.9007 3.8527 4.0613 3.6954 3.7427 3.9450 3.9227 3.9057 3.7299 3.4744 4.0295 3.9516 3.8210 3.8393 3.8963 1.0038 1.0291 1.0006 0.9983 1.0136 1.0021 1.0020 1.0046 0.9987 1.0185 0.9982 1.0055 0.9987 1.0069 0.9970 0.9960 1.0241 1.0232 0.9991 0.9995 1.0026 1.0197 1.0002 1.0018 1.0038 1.0206
dispcorr: -0.023798345 hartree
energy: -965.439748750321
dipole: 15.67024 -14.64940 1.02084 3.19569 -1.06068 2.13501 4.87963 -3.96076 0.91887
magnitude: 2.53864 au
magnitude: 6.45271 debye
