program: Orca
programVersion: 5.0.2
elementType: O O O C C C C C C C C C C C C C C C C C C C H H H H H H H H H H H H H H H H H H H H H H H H H H
charge: 0
multiplicity: 1
keywords: wb97x-d3
keywords: def2-TZVPP
keywords: def2/J RIJCOSX
keywords: DEFGRID2
keywords: scfconv7
keywords: smallprint printgap noloewdin
keywords: NOSOSCF
formula: C19H26O3
InChI: InChI=1/C19H26O3/c1-7-8-13-12(4)16(10-15(13)20)22-18(21)17-14(9-11(2)3)19(17,5)6/h7,9,14,16-17H,1,8,10H2,2-6H3
48 atoms
O  0.321835 0.910814 0.27233
O  0.818541 1.939282 2.194245
O  -3.696813 0.578075 -1.95688
C  3.415568 1.404767 -0.149898
C  3.105935 -0.050699 -0.046282
C  2.56593 0.903837 1.009351
C  2.793109 2.230969 -1.247868
C  4.803448 1.865301 0.222111
C  2.304991 -0.763064 -1.074807
C  1.164043 1.304959 1.219407
C  1.663861 -1.919557 -0.893354
C  -1.050732 1.314674 0.327948
C  1.557122 -2.60198 0.434675
C  0.989211 -2.6193 -2.033201
C  -1.601681 1.437379 -1.085228
C  -1.905781 0.259662 0.986649
C  -2.956432 -0.074604 0.219807
C  -2.877476 0.633341 -1.059843
C  -1.580721 -0.277391 2.329006
C  -4.039837 -1.050663 0.524867
C  -3.677084 -2.478423 0.231656
C  -2.480905 -2.922867 -0.133861
H  3.914031 -0.650775 0.364926
H  3.094106 0.876847 1.955807
H  3.423179 2.193325 -2.138621
H  1.798114 1.903306 -1.541293
H  2.721634 3.276941 -0.944015
H  4.791035 2.894149 0.586718
H  5.242163 1.239584 1.00001
H  5.464276 1.829075 -0.646302
H  2.308679 -0.333596 -2.072634
H  -1.138494 2.257321 0.872727
H  2.033408 -2.045766 1.240965
H  2.007073 -3.597966 0.399614
H  0.506906 -2.75076 0.703448
H  1.401452 -3.62187 -2.174326
H  1.100368 -2.075639 -2.971208
H  -0.078846 -2.750169 -1.842796
H  -0.919638 0.994295 -1.815257
H  -1.785601 2.467022 -1.391675
H  -2.33918 -0.973706 2.681193
H  -0.625471 -0.80825 2.31156
H  -1.485031 0.52712 3.059717
H  -4.937444 -0.793277 -0.044496
H  -4.336624 -0.976744 1.575371
H  -4.490924 -3.18688 0.34974
H  -2.307612 -3.975423 -0.316258
H  -1.633239 -2.26141 -0.265701
elementType: O C H
totalener: -965.41176909 hartree
nucrepener: 1913.74992010 hartree
electener: -2879.16168919 hartree
oneelecener: -5113.45462039 hartree
twoeener: 2234.29293120 hartree
cpcmener: -0.03733066 hartree
kineticenergy: 961.00325926 hartree
xcener: -95.145670422196 hartree
chargesum: -0.0000000
charge: -0.266637 -0.502935 -0.483878 0.136390 -0.003427 -0.174495 -0.293445 -0.267575 -0.262744 0.451569 -0.029905 0.219174 -0.280256 -0.234396 -0.136783 -0.026525 -0.087243 0.314861 -0.257842 -0.072113 -0.193773 -0.236897 0.116876 0.098333 0.103402 0.088184 0.103436 0.095302 0.088052 0.093634 0.127467 0.110535 0.097776 0.111833 0.090058 0.100531 0.091954 0.095464 0.101494 0.105797 0.104268 0.113432 0.123525 0.091106 0.103890 0.134137 0.140593 0.057798
qa: -0.2666 -0.5029 -0.4839 0.1364 -0.0034 -0.1745 -0.2934 -0.2676 -0.2627 0.4516 -0.0299 0.2192 -0.2803 -0.2344 -0.1368 -0.0265 -0.0872 0.3149 -0.2578 -0.0721 -0.1938 -0.2369 0.1169 0.0983 0.1034 0.0882 0.1034 0.0953 0.0881 0.0936 0.1275 0.1105 0.0978 0.1118 0.0901 0.1005 0.0920 0.0955 0.1015 0.1058 0.1043 0.1134 0.1235 0.0911 0.1039 0.1341 0.1406 0.0578
va: 2.1220 1.9910 2.0157 3.7401 3.7715 3.9184 3.9173 3.9034 3.8417 4.0622 3.6850 3.7559 3.9533 3.9248 3.9026 3.7035 3.4298 4.0407 3.9383 3.8438 3.9014 3.8857 1.0023 1.0279 0.9988 1.0041 1.0015 1.0019 1.0053 1.0016 0.9961 1.0285 1.0031 1.0015 0.9920 0.9964 1.0080 0.9894 1.0254 1.0227 1.0045 0.9945 1.0077 1.0206 0.9989 1.0009 0.9988 1.0402
dispcorr: -0.027895060 hartree
energy: -965.439664153157
dipole: 12.90055 -11.46378 1.43677 -9.93914 9.27077 -0.66837 -1.34950 2.06965 0.72016
magnitude: 1.74059 au
magnitude: 4.42423 debye
