program: Orca
programVersion: 5.0.2
elementType: O O O C C C C C C C C C C C C C C C C C C C H H H H H H H H H H H H H H H H H H H H H H H H H H
charge: 0
multiplicity: 1
keywords: wb97x-d3
keywords: def2-TZVPP
keywords: def2/J RIJCOSX
keywords: DEFGRID2
keywords: scfconv7
keywords: smallprint printgap noloewdin
keywords: NOSOSCF
formula: C19H26O3
InChI: InChI=1/C19H26O3/c1-7-8-13-12(4)16(10-15(13)20)22-18(21)17-14(9-11(2)3)19(17,5)6/h7,9,14,16-17H,1,8,10H2,2-6H3
48 atoms
O  0.248824 0.665443 0.536742
O  0.842306 2.37062 1.839602
O  -4.044962 2.023414 -0.574637
C  2.863928 1.192985 -0.97796
C  3.128874 0.08865 -0.013274
C  2.501554 1.393718 0.48585
C  1.802714 1.066463 -2.042758
C  4.05221 2.002622 -1.442057
C  2.420883 -1.212448 -0.048004
C  1.136916 1.528819 1.016004
C  2.548422 -2.167386 0.878055
C  -1.097354 0.768952 1.013134
C  3.364265 -2.007522 2.124755
C  1.87858 -3.498186 0.724244
C  -1.85951 1.977119 0.480902
C  -1.852332 -0.426834 0.499358
C  -3.007122 -0.07276 -0.087411
C  -3.110277 1.387625 -0.125707
C  -1.327976 -1.7990 0.692946
C  -4.044186 -0.975467 -0.675738
C  -3.660539 -1.4047 -2.060726
C  -3.460597 -2.664969 -2.426055
H  4.163365 0.015225 0.30896
H  3.182288 2.039626 1.027946
H  1.401839 2.049218 -2.297533
H  2.249182 0.652051 -2.948506
H  0.965428 0.429478 -1.774057
H  4.816263 2.085895 -0.668447
H  4.512874 1.53643 -2.315229
H  3.750879 3.012752 -1.7255
H  1.800308 -1.420364 -0.914017
H  -1.091954 0.746184 2.106919
H  4.272647 -2.614702 2.076179
H  2.805773 -2.359689 2.995128
H  3.661501 -0.977682 2.316228
H  1.338646 -3.58293 -0.218525
H  1.172001 -3.679785 1.538242
H  2.610713 -4.308972 0.766644
H  -1.298594 2.500118 -0.297766
H  -2.108097 2.70702 1.251045
H  -2.111863 -2.54997 0.608514
H  -0.574351 -2.026724 -0.064606
H  -0.846152 -1.904504 1.665853
H  -5.000711 -0.446567 -0.707289
H  -4.185933 -1.85284 -0.041667
H  -3.533351 -0.608484 -2.788373
H  -3.177419 -2.9212 -3.438834
H  -3.576175 -3.48652 -1.728331
elementType: O C H
totalener: -965.41364392 hartree
nucrepener: 1875.48515163 hartree
electener: -2840.89879555 hartree
oneelecener: -5036.77416958 hartree
twoeener: 2195.87537404 hartree
cpcmener: -0.03778487 hartree
kineticenergy: 961.00290738 hartree
xcener: -95.143366658862 hartree
chargesum: 0.0000000
charge: -0.277740 -0.504610 -0.488112 0.143452 -0.022444 -0.120958 -0.294490 -0.265380 -0.273702 0.427298 -0.006283 0.225406 -0.272897 -0.264410 -0.141562 -0.006565 -0.061562 0.321368 -0.333790 -0.099991 -0.180465 -0.289598 0.114072 0.093924 0.104893 0.102440 0.084820 0.088445 0.093799 0.096037 0.130078 0.112859 0.104780 0.096038 0.090337 0.095255 0.096187 0.111041 0.108423 0.105113 0.115085 0.120347 0.127412 0.095265 0.107063 0.145440 0.132119 0.115763
qa: -0.2777 -0.5046 -0.4881 0.1435 -0.0224 -0.1210 -0.2945 -0.2654 -0.2737 0.4273 -0.0063 0.2254 -0.2729 -0.2644 -0.1416 -0.0066 -0.0616 0.3214 -0.3338 -0.1000 -0.1805 -0.2896 0.1141 0.0939 0.1049 0.1024 0.0848 0.0884 0.0938 0.0960 0.1301 0.1129 0.1048 0.0960 0.0903 0.0953 0.0962 0.1110 0.1084 0.1051 0.1151 0.1203 0.1274 0.0953 0.1071 0.1454 0.1321 0.1158
va: 2.1153 1.9964 2.0082 3.7523 3.7720 3.8966 3.9037 3.9000 3.8365 4.0926 3.6556 3.7621 3.9517 3.9338 3.9063 3.6933 3.4463 4.0467 3.9581 3.8519 3.7905 3.9400 1.0011 1.0281 0.9996 1.0002 1.0133 1.0053 1.0020 1.0017 0.9970 1.0155 0.9961 0.9985 1.0048 1.0027 0.9931 0.9981 1.0192 1.0245 1.0062 0.9887 0.9972 1.0244 1.0061 1.0021 1.0031 1.0093
dispcorr: -0.025833187 hartree
energy: -965.439477102238
dipole: 14.58514 -12.71074 1.87439 -16.32177 13.90204 -2.41973 -4.88899 4.89294 0.00395
magnitude: 3.06080 au
magnitude: 7.77993 debye
