program: Orca
programVersion: 5.0.2
elementType: O O O C C C C C C C C C C C C C C C C C C C H H H H H H H H H H H H H H H H H H H H H H H H H H
charge: 0
multiplicity: 1
keywords: wb97x-d3
keywords: def2-TZVPP
keywords: def2/J RIJCOSX
keywords: DEFGRID2
keywords: scfconv7
keywords: smallprint printgap noloewdin
keywords: NOSOSCF
formula: C19H26O3
InChI: InChI=1/C19H26O3/c1-7-8-13-12(4)16(10-15(13)20)22-18(21)17-14(9-11(2)3)19(17,5)6/h7,9,14,16-17H,1,8,10H2,2-6H3
48 atoms
O  -0.013344 0.921375 0.723664
O  1.076247 2.483872 -0.437422
O  -2.81898 -0.913978 -2.134381
C  3.689194 1.095052 0.494792
C  2.964771 -0.161047 0.109112
C  2.272821 0.913934 0.954073
C  4.087846 2.118473 -0.541844
C  4.720391 0.95562 1.591744
C  2.488595 -0.415242 -1.274365
C  1.09415 1.554923 0.334866
C  1.568263 -1.325797 -1.609523
C  -1.267873 1.340874 0.16867
C  0.874329 -2.213518 -0.623487
C  1.14755 -1.515112 -3.0350
C  -1.451174 0.901796 -1.279389
C  -2.314475 0.5811 0.942442
C  -2.992994 -0.274246 0.162264
C  -2.47421 -0.205013 -1.208439
C  -2.464616 0.792929 2.401028
C  -4.04416 -1.252273 0.581209
C  -3.408831 -2.472358 1.183465
C  -3.603974 -2.8824 2.431043
H  3.226381 -1.047685 0.678228
H  2.120585 0.653598 1.996845
H  5.088419 1.884757 -0.909473
H  3.428826 2.168182 -1.403676
H  4.128904 3.115122 -0.09995
H  4.423054 0.216923 2.33749
H  5.681898 0.644834 1.179137
H  4.871057 1.906233 2.107211
H  2.923864 0.182585 -2.069229
H  -1.384244 2.419055 0.303109
H  1.159472 -2.025425 0.40991
H  1.082204 -3.264515 -0.843079
H  -0.211119 -2.097376 -0.698705
H  0.072662 -1.348755 -3.147394
H  1.336344 -2.538568 -3.368863
H  1.668036 -0.837226 -3.711035
H  -0.532404 0.559824 -1.757707
H  -1.847521 1.713985 -1.892451
H  -1.608962 0.374479 2.93817
H  -2.490238 1.859417 2.636188
H  -3.364886 0.32704 2.797068
H  -4.639953 -1.53716 -0.290466
H  -4.727851 -0.794733 1.299382
H  -2.733639 -3.02498 0.534586
H  -3.113045 -3.76684 2.817074
H  -4.269467 -2.358649 3.108794
elementType: O C H
totalener: -965.41275849 hartree
nucrepener: 1899.82176836 hartree
electener: -2865.23452685 hartree
oneelecener: -5086.22332532 hartree
twoeener: 2220.98879847 hartree
cpcmener: -0.03531540 hartree
kineticenergy: 960.98954044 hartree
xcener: -95.138244590031 hartree
chargesum: 0.0000000
charge: -0.277356 -0.473539 -0.490441 0.138594 -0.038416 -0.115682 -0.289889 -0.270991 -0.212838 0.375452 -0.067600 0.250162 -0.260350 -0.225325 -0.165566 -0.038641 -0.067984 0.316317 -0.258285 -0.096037 -0.184908 -0.289659 0.107209 0.103219 0.096937 0.082263 0.102883 0.087194 0.095461 0.095652 0.131596 0.114875 0.092890 0.112331 0.080208 0.079960 0.105432 0.093477 0.107665 0.124964 0.113893 0.118578 0.099221 0.097731 0.106452 0.143593 0.132064 0.117234
qa: -0.2774 -0.4735 -0.4904 0.1386 -0.0384 -0.1157 -0.2899 -0.2710 -0.2128 0.3755 -0.0676 0.2502 -0.2603 -0.2253 -0.1656 -0.0386 -0.0680 0.3163 -0.2583 -0.0960 -0.1849 -0.2897 0.1072 0.1032 0.0969 0.0823 0.1029 0.0872 0.0955 0.0957 0.1316 0.1149 0.0929 0.1123 0.0802 0.0800 0.1054 0.0935 0.1077 0.1250 0.1139 0.1186 0.0992 0.0977 0.1065 0.1436 0.1321 0.1172
va: 2.1128 2.0178 1.9870 3.7664 3.7983 3.8335 3.8952 3.8985 3.7900 4.1560 3.7342 3.7402 3.9536 3.9074 3.9122 3.7885 3.5037 3.9691 3.9433 3.8501 3.7890 3.9431 1.0026 1.0259 1.0003 1.0141 1.0012 1.0034 1.0024 1.0024 0.9977 1.0167 1.0084 1.0021 0.9946 1.0106 0.9972 1.0063 1.0214 1.0179 1.0015 1.0012 1.0043 1.0227 1.0054 1.0040 1.0034 1.0089
dispcorr: -0.027142358 hartree
energy: -965.439900846570
dipole: 10.19908 -9.93579 0.26329 -6.46207 6.57338 0.11131 4.87357 -2.58939 2.28418
magnitude: 2.30199 au
magnitude: 5.85120 debye
