program: Orca
programVersion: 5.0.2
elementType: O O O C C C C C C C C C C C C C C C C C C C H H H H H H H H H H H H H H H H H H H H H H H H H H
charge: 0
multiplicity: 1
keywords: wb97x-d3
keywords: def2-TZVPP
keywords: def2/J RIJCOSX
keywords: DEFGRID2
keywords: scfconv7
keywords: smallprint printgap noloewdin
keywords: NOSOSCF
formula: C19H26O3
InChI: InChI=1/C19H26O3/c1-7-8-13-12(4)16(10-15(13)20)22-18(21)17-14(9-11(2)3)19(17,5)6/h7,9,14,16-17H,1,8,10H2,2-6H3
48 atoms
O  0.120283 0.863146 0.671467
O  1.026806 2.357678 -0.71408
O  -2.475535 -1.641297 -1.933649
C  3.779118 1.420937 0.385276
C  3.204492 0.037852 0.286517
C  2.388905 1.179071 0.894686
C  4.062726 2.226508 -0.860275
C  4.815134 1.63982 1.464155
C  2.792235 -0.556287 -1.0109
C  1.148124 1.56083 0.185836
C  1.956633 -1.59138 -1.143717
C  -1.16447 1.030169 0.056768
C  1.296034 -2.279301 0.009916
C  1.609812 -2.143042 -2.492327
C  -1.260764 0.365004 -1.311285
C  -2.13173 0.270803 0.928517
C  -2.6837 -0.767354 0.28191
C  -2.18271 -0.809609 -1.09623
C  -2.37834 0.708345 2.321529
C  -3.693739 -1.738768 0.805528
C  -5.08167 -1.18458 0.67307
C  -5.88494 -0.923384 1.696701
H  3.560553 -0.672941 1.026205
H  2.262876 1.126638 1.971766
H  4.021319 3.295175 -0.644476
H  5.073361 2.004081 -1.207942
H  3.385052 2.030803 -1.686529
H  4.851147 2.688925 1.763693
H  4.605181 1.047006 2.355565
H  5.808479 1.362193 1.106949
H  3.215997 -0.125632 -1.912933
H  -1.419081 2.092582 0.026938
H  0.208482 -2.244202 -0.09291
H  1.554258 -1.852091 0.976636
H  1.565209 -3.338298 0.027885
H  2.093708 -1.593325 -3.29928
H  0.529537 -2.112636 -2.659198
H  1.903968 -3.192675 -2.573967
H  -0.299681 0.036769 -1.710488
H  -1.701343 1.036324 -2.051015
H  -2.805196 1.714301 2.323602
H  -3.060904 0.048421 2.852141
H  -1.446066 0.765315 2.88622
H  -3.485624 -1.979085 1.8495
H  -3.614639 -2.672692 0.242679
H  -5.417082 -0.977234 -0.338846
H  -6.874213 -0.510561 1.546685
H  -5.58526 -1.112047 2.721262
elementType: O C H
totalener: -965.41289938 hartree
nucrepener: 1883.39788069 hartree
electener: -2848.81078007 hartree
oneelecener: -5053.23974463 hartree
twoeener: 2204.42896456 hartree
cpcmener: -0.03527226 hartree
kineticenergy: 961.00546281 hartree
xcener: -95.141565088647 hartree
chargesum: 0.0000000
charge: -0.279441 -0.471773 -0.492089 0.139185 -0.030882 -0.124208 -0.295356 -0.271553 -0.215403 0.381475 -0.061676 0.251245 -0.272885 -0.223411 -0.176081 -0.040343 -0.075597 0.342776 -0.240562 -0.119945 -0.178050 -0.289948 0.105475 0.104642 0.102529 0.098459 0.083317 0.095503 0.087486 0.095070 0.128156 0.115166 0.090778 0.093808 0.111243 0.092677 0.080338 0.105070 0.110546 0.123213 0.115814 0.094070 0.112806 0.106190 0.097449 0.145835 0.132614 0.116271
qa: -0.2794 -0.4718 -0.4921 0.1392 -0.0309 -0.1242 -0.2954 -0.2716 -0.2154 0.3815 -0.0617 0.2512 -0.2729 -0.2234 -0.1761 -0.0403 -0.0756 0.3428 -0.2406 -0.1199 -0.1780 -0.2899 0.1055 0.1046 0.1025 0.0985 0.0833 0.0955 0.0875 0.0951 0.1282 0.1152 0.0908 0.0938 0.1112 0.0927 0.0803 0.1051 0.1105 0.1232 0.1158 0.0941 0.1128 0.1062 0.0974 0.1458 0.1326 0.1163
va: 2.1119 2.0208 1.9887 3.7602 3.7989 3.8461 3.9008 3.8973 3.7974 4.1444 3.7238 3.7258 3.9507 3.9077 3.9134 3.7868 3.4734 3.9540 3.9401 3.8697 3.7857 3.9410 1.0033 1.0251 1.0017 0.9997 1.0119 1.0026 1.0034 1.0022 0.9982 1.0174 0.9943 1.0087 1.0022 1.0063 1.0092 0.9972 1.0192 1.0196 0.9961 1.0066 1.0085 1.0051 1.0232 1.0031 1.0032 1.0085
dispcorr: -0.026725036 hartree
energy: -965.439624414363
dipole: 8.77462 -8.39988 0.37474 -3.19580 3.54772 0.35191 5.22325 -2.89078 2.33247
magnitude: 2.38845 au
magnitude: 6.07096 debye
