program: Orca
programVersion: 5.0.2
elementType: O O O C C C C C C C C C C C C C C C C C C C H H H H H H H H H H H H H H H H H H H H H H H H H H
charge: 0
multiplicity: 1
keywords: wb97x-d3
keywords: def2-TZVPP
keywords: def2/J RIJCOSX
keywords: DEFGRID2
keywords: scfconv7
keywords: smallprint printgap noloewdin
keywords: NOSOSCF
formula: C19H26O3
InChI: InChI=1/C19H26O3/c1-7-8-13-12(4)16(10-15(13)20)22-18(21)17-14(9-11(2)3)19(17,5)6/h7,9,14,16-17H,1,8,10H2,2-6H3
48 atoms
O  0.12471 0.862128 0.685117
O  1.018943 2.384344 -0.67844
O  -2.479106 -1.587716 -1.965752
C  3.779698 1.416593 0.375958
C  3.195854 0.037631 0.268973
C  2.393921 1.177672 0.898097
C  4.054623 2.233831 -0.863925
C  4.829569 1.617006 1.444966
C  2.766371 -0.539379 -1.030197
C  1.147171 1.570973 0.205739
C  1.926771 -1.570876 -1.166481
C  -1.166199 1.036758 0.085421
C  1.277207 -2.272058 -0.014454
C  1.564435 -2.1044 -2.518292
C  -1.269998 0.408071 -1.299395
C  -2.119712 0.24638 0.945025
C  -2.673884 -0.77501 0.273771
C  -2.184875 -0.776217 -1.109095
C  -2.349162 0.639521 2.354222
C  -3.671066 -1.7691 0.779001
C  -5.065128 -1.221305 0.693853
C  -5.855835 -1.023613 1.741317
H  3.555919 -0.682768 0.997345
H  2.279508 1.114313 1.975917
H  4.022863 3.300212 -0.635488
H  5.059826 2.008768 -1.225269
H  3.366405 2.052313 -1.684721
H  4.627005 1.014271 2.331398
H  5.816996 1.338488 1.072278
H  4.874968 2.662129 1.756815
H  3.180794 -0.099081 -1.931961
H  -1.42802 2.097889 0.086994
H  1.560903 -3.327754 -0.001755
H  0.188716 -2.250732 -0.115503
H  1.532205 -1.84535 0.95384
H  1.849102 -3.155409 -2.614312
H  2.046501 -1.549336 -3.322682
H  0.483234 -2.063141 -2.676487
H  -0.310658 0.093381 -1.713421
H  -1.717231 1.09747 -2.018196
H  -3.015171 -0.044115 2.875971
H  -1.408279 0.690517 2.905128
H  -2.787323 1.639851 2.393471
H  -3.442318 -2.046657 1.809383
H  -3.59769 -2.681538 0.181097
H  -5.418203 -0.966656 -0.301106
H  -6.854126 -0.621023 1.62723
H  -5.539207 -1.265336 2.749576
elementType: O C H
totalener: -965.41284372 hartree
nucrepener: 1884.59557565 hartree
electener: -2850.00841936 hartree
oneelecener: -5055.63688952 hartree
twoeener: 2205.62847016 hartree
cpcmener: -0.03524558 hartree
kineticenergy: 961.00191389 hartree
xcener: -95.140936717229 hartree
chargesum: -0.0000000
charge: -0.278963 -0.471734 -0.491849 0.139104 -0.030545 -0.124525 -0.295105 -0.271464 -0.214665 0.381058 -0.062685 0.252260 -0.274820 -0.224864 -0.175491 -0.041344 -0.075805 0.341242 -0.241212 -0.119492 -0.178011 -0.289481 0.105448 0.104986 0.102466 0.098515 0.083031 0.087436 0.095137 0.095470 0.128497 0.115705 0.111839 0.091683 0.093582 0.105073 0.092746 0.081420 0.111162 0.123465 0.094396 0.112574 0.116061 0.106139 0.097231 0.145730 0.132560 0.116039
qa: -0.2790 -0.4717 -0.4918 0.1391 -0.0305 -0.1245 -0.2951 -0.2715 -0.2147 0.3811 -0.0627 0.2523 -0.2748 -0.2249 -0.1755 -0.0413 -0.0758 0.3412 -0.2412 -0.1195 -0.1780 -0.2895 0.1054 0.1050 0.1025 0.0985 0.0830 0.0874 0.0951 0.0955 0.1285 0.1157 0.1118 0.0917 0.0936 0.1051 0.0927 0.0814 0.1112 0.1235 0.0944 0.1126 0.1161 0.1061 0.0972 0.1457 0.1326 0.1160
va: 2.1127 2.0207 1.9893 3.7606 3.7973 3.8455 3.9011 3.8970 3.7961 4.1460 3.7224 3.7245 3.9506 3.9070 3.9105 3.7855 3.4677 3.9555 3.9404 3.8685 3.7873 3.9406 1.0031 1.0249 1.0017 0.9997 1.0118 1.0034 1.0022 1.0026 0.9980 1.0169 1.0020 0.9938 1.0088 0.9973 1.0063 1.0094 1.0195 1.0193 1.0065 1.0087 0.9960 1.0049 1.0233 1.0031 1.0032 1.0086
dispcorr: -0.026797253 hartree
energy: -965.439640968096
dipole: 8.79179 -8.40887 0.38291 -3.49086 3.77910 0.28824 5.19105 -2.83997 2.35108
magnitude: 2.39943 au
magnitude: 6.09886 debye
