program: Orca
programVersion: 5.0.2
elementType: O O O C C C C C C C C C C C C C C C C C C C H H H H H H H H H H H H H H H H H H H H H H H H H H
charge: 0
multiplicity: 1
keywords: wb97x-d3
keywords: def2-TZVPP
keywords: def2/J RIJCOSX
keywords: DEFGRID2
keywords: scfconv7
keywords: smallprint printgap noloewdin
keywords: NOSOSCF
formula: C19H26O3
InChI: InChI=1/C19H26O3/c1-7-8-13-12(4)16(10-15(13)20)22-18(21)17-14(9-11(2)3)19(17,5)6/h7,9,14,16-17H,1,8,10H2,2-6H3
48 atoms
O  -0.08622 0.916288 0.657636
O  1.105765 1.90395 -0.947464
O  -3.242453 -1.22246 -1.721751
C  3.654964 1.081952 0.592574
C  3.135669 -0.249606 0.165816
C  2.205237 0.758338 0.861232
C  4.082817 2.115394 -0.421074
C  4.518228 1.102974 1.833573
C  2.922892 -0.617172 -1.256599
C  1.067401 1.276972 0.086314
C  2.066097 -1.556417 -1.668753
C  -1.301191 1.259513 -0.021171
C  1.193059 -2.340773 -0.737297
C  1.920625 -1.901012 -3.118678
C  -1.534937 0.444608 -1.288376
C  -2.419564 0.866983 0.908999
C  -3.235188 -0.045155 0.358272
C  -2.748261 -0.396167 -0.978952
C  -2.509263 1.463065 2.262279
C  -4.414662 -0.713199 0.972185
C  -4.070171 -1.949308 1.753461
C  -2.849745 -2.398506 2.020694
H  3.3931 -1.079461 0.817769
H  1.956577 0.508474 1.886251
H  3.932073 3.122609 -0.029482
H  5.150188 2.000009 -0.617986
H  3.568554 2.050275 -1.374827
H  4.475214 2.078687 2.321018
H  4.20482 0.353155 2.561056
H  5.560475 0.903815 1.577884
H  3.519731 -0.100206 -2.001823
H  -1.320127 2.33655 -0.208511
H  1.182311 -1.94867 0.278158
H  1.523881 -3.381624 -0.688384
H  0.162331 -2.364526 -1.098439
H  2.596182 -1.323913 -3.749499
H  0.898064 -1.716365 -3.458258
H  2.116457 -2.961985 -3.29291
H  -0.692145 -0.196232 -1.552822
H  -1.736976 1.079702 -2.152318
H  -3.429721 1.190196 2.77447
H  -1.671891 1.137471 2.883145
H  -2.451762 2.551895 2.206377
H  -5.136371 -0.981236 0.195348
H  -4.947052 -0.021891 1.631744
H  -4.926722 -2.499663 2.130025
H  -2.707754 -3.300187 2.602154
H  -1.951903 -1.899485 1.675135
elementType: O C H
totalener: -965.41454661 hartree
nucrepener: 1883.05896901 hartree
electener: -2848.47351562 hartree
oneelecener: -5052.80909652 hartree
twoeener: 2204.33558090 hartree
cpcmener: -0.03773268 hartree
kineticenergy: 961.00492067 hartree
xcener: -95.143582109299 hartree
chargesum: -0.0000000
charge: -0.293029 -0.485163 -0.486491 0.145174 -0.021865 -0.101844 -0.295967 -0.267674 -0.277321 0.375301 -0.008984 0.273611 -0.282249 -0.223668 -0.154691 -0.048508 -0.092322 0.323464 -0.257180 -0.071660 -0.188909 -0.274036 0.113088 0.098708 0.102800 0.097718 0.087912 0.095854 0.087326 0.095302 0.126994 0.114049 0.093559 0.117429 0.090187 0.089778 0.094036 0.098706 0.090822 0.119706 0.101958 0.111471 0.118853 0.091295 0.105057 0.134830 0.133081 0.103491
qa: -0.2930 -0.4852 -0.4865 0.1452 -0.0219 -0.1018 -0.2960 -0.2677 -0.2773 0.3753 -0.0090 0.2736 -0.2822 -0.2237 -0.1547 -0.0485 -0.0923 0.3235 -0.2572 -0.0717 -0.1889 -0.2740 0.1131 0.0987 0.1028 0.0977 0.0879 0.0959 0.0873 0.0953 0.1270 0.1140 0.0936 0.1174 0.0902 0.0898 0.0940 0.0987 0.0908 0.1197 0.1020 0.1115 0.1189 0.0913 0.1051 0.1348 0.1331 0.1035
va: 2.1082 2.0052 2.0059 3.7567 3.8088 3.8255 3.8899 3.8992 3.8418 4.1218 3.6801 3.7292 3.9493 3.9223 3.9059 3.7549 3.4652 4.0089 3.9496 3.8266 3.8408 3.8961 1.0047 1.0271 1.0004 0.9992 1.0167 1.0024 1.0039 1.0021 1.0010 1.0153 1.0055 0.9993 0.9972 1.0072 0.9958 0.9950 1.0243 1.0215 1.0035 1.0017 0.9985 1.0180 1.0011 1.0013 1.0044 1.0225
dispcorr: -0.026002327 hartree
energy: -965.440548938665
dipole: 12.57312 -12.10529 0.46783 -4.12062 4.81710 0.69648 4.86851 -2.58549 2.28301
magnitude: 2.43230 au
magnitude: 6.18242 debye
