program: Orca
programVersion: 5.0.2
elementType: O O O C C C C C C C C C C C C C C C C C C C H H H H H H H H H H H H H H H H H H H H H H H H H H
charge: 0
multiplicity: 1
keywords: wb97x-d3
keywords: def2-TZVPP
keywords: def2/J RIJCOSX
keywords: DEFGRID2
keywords: scfconv7
keywords: smallprint printgap noloewdin
keywords: NOSOSCF
formula: C19H26O3
InChI: InChI=1/C19H26O3/c1-7-8-13-12(4)16(10-15(13)20)22-18(21)17-14(9-11(2)3)19(17,5)6/h7,9,14,16-17H,1,8,10H2,2-6H3
48 atoms
O  0.226343 0.567796 0.452577
O  0.904844 2.137064 1.878192
O  -4.086373 1.936969 -0.392956
C  2.773195 1.003118 -1.130971
C  3.135616 -0.007035 -0.10036
C  2.469949 1.307878 0.326558
C  1.683642 0.735265 -2.141243
C  3.899761 1.830396 -1.707363
C  2.474416 -1.327685 0.022675
C  1.143741 1.383278 0.956689
C  2.526668 -2.072702 1.129912
C  -1.085021 0.602634 1.026472
C  3.202123 -1.590351 2.382041
C  1.934779 -3.445933 1.18473
C  -1.893741 1.836391 0.641838
C  -1.849145 -0.561125 0.455287
C  -3.021312 -0.178756 -0.075136
C  -3.141614 1.27924 -0.00079
C  -1.303539 -1.936256 0.531601
C  -4.057287 -1.038758 -0.710974
C  -3.779687 -1.378216 -2.147353
C  -2.690799 -1.064247 -2.839101
H  4.185519 -0.015459 0.182174
H  3.145938 2.019017 0.786418
H  1.168015 1.659885 -2.406245
H  2.13495 0.3422 -3.0540
H  0.93446 0.017287 -1.819598
H  4.684277 2.018562 -0.973911
H  4.354467 1.315691 -2.555873
H  3.534075 2.795945 -2.061387
H  1.971906 -1.725396 -0.85399
H  -1.00664 0.489306 2.111496
H  4.285585 -1.73154 2.328718
H  2.854167 -2.139925 3.257605
H  3.026843 -0.528399 2.563653
H  1.162188 -3.509216 1.955246
H  2.694371 -4.185815 1.451046
H  1.492126 -3.743302 0.234322
H  -1.365796 2.46526 -0.078859
H  -2.149703 2.464232 1.495474
H  -0.870491 -2.130594 1.515476
H  -2.065282 -2.688765 0.330285
H  -0.502822 -2.070918 -0.200852
H  -5.033544 -0.548752 -0.650381
H  -4.170436 -1.972337 -0.150838
H  -4.565812 -1.945917 -2.635489
H  -2.584997 -1.370273 -3.871956
H  -1.866058 -0.50384 -2.413706
elementType: O C H
totalener: -965.41282921 hartree
nucrepener: 1898.56794361 hartree
electener: -2863.98077283 hartree
oneelecener: -5082.98264569 hartree
twoeener: 2219.00187286 hartree
cpcmener: -0.03896833 hartree
kineticenergy: 960.99634495 hartree
xcener: -95.143581352045 hartree
chargesum: -0.0000000
charge: -0.277786 -0.509095 -0.484006 0.145818 -0.032684 -0.126055 -0.278029 -0.268215 -0.274735 0.424564 0.000254 0.235170 -0.278487 -0.255880 -0.145578 -0.026072 -0.076188 0.326558 -0.311741 -0.074043 -0.185992 -0.277438 0.115142 0.094322 0.105516 0.099984 0.069366 0.087879 0.093523 0.096610 0.132431 0.112964 0.108073 0.096535 0.096669 0.094009 0.115226 0.093019 0.107166 0.106177 0.126207 0.116433 0.113069 0.089751 0.105842 0.134534 0.132935 0.106279
qa: -0.2778 -0.5091 -0.4840 0.1458 -0.0327 -0.1261 -0.2780 -0.2682 -0.2747 0.4246 0.0003 0.2352 -0.2785 -0.2559 -0.1456 -0.0261 -0.0762 0.3266 -0.3117 -0.0740 -0.1860 -0.2774 0.1151 0.0943 0.1055 0.1000 0.0694 0.0879 0.0935 0.0966 0.1324 0.1130 0.1081 0.0965 0.0967 0.0940 0.1152 0.0930 0.1072 0.1062 0.1262 0.1164 0.1131 0.0898 0.1058 0.1345 0.1329 0.1063
va: 2.1197 1.9889 2.0165 3.7449 3.7940 3.8865 3.9117 3.9032 3.7998 4.0828 3.6528 3.7449 3.9499 3.9259 3.9015 3.6899 3.4372 4.0399 3.9621 3.8279 3.8427 3.8953 1.0017 1.0293 1.0000 1.0014 1.0045 1.0056 1.0023 1.0013 0.9955 1.0158 0.9961 1.0037 1.0011 0.9929 0.9965 1.0037 1.0211 1.0237 0.9940 1.0065 0.9902 1.0208 1.0016 1.0009 1.0045 1.0179
dispcorr: -0.027191221 hartree
energy: -965.440020435664
dipole: 14.66043 -12.92166 1.73877 -14.48757 11.94218 -2.54539 -5.07070 4.97173 -0.09897
magnitude: 3.08417 au
magnitude: 7.83935 debye
