program: Orca
programVersion: 5.0.2
elementType: O O O C C C C C C C C C C C C C C C C C C C H H H H H H H H H H H H H H H H H H H H H H H H H H
charge: 0
multiplicity: 1
keywords: wb97x-d3
keywords: def2-TZVPP
keywords: def2/J RIJCOSX
keywords: DEFGRID2
keywords: scfconv7
keywords: smallprint printgap noloewdin
keywords: NOSOSCF
formula: C19H26O3
InChI: InChI=1/C19H26O3/c1-7-8-13-12(4)16(10-15(13)20)22-18(21)17-14(9-11(2)3)19(17,5)6/h7,9,14,16-17H,1,8,10H2,2-6H3
48 atoms
O  0.004597 1.016975 0.84698
O  1.052433 2.495914 -0.453375
O  -2.879126 -0.957736 -1.780335
C  3.692557 1.08735 0.366442
C  2.921809 -0.158982 0.048555
C  2.301509 0.945393 0.91236
C  4.052601 2.080484 -0.712752
C  4.78479 0.942864 1.401691
C  2.364695 -0.435444 -1.299519
C  1.09921 1.598626 0.354584
C  1.401688 -1.329058 -1.549732
C  -1.275646 1.430215 0.342291
C  0.749271 -2.161136 -0.488215
C  0.908667 -1.572963 -2.942901
C  -1.533372 0.937869 -1.076645
C  -2.277554 0.694415 1.197507
C  -2.945642 -0.23341 0.494996
C  -2.506156 -0.201164 -0.904643
C  -2.385288 1.001779 2.642581
C  -3.908234 -1.267563 0.981358
C  -3.144229 -2.520285 1.303937
C  -3.158632 -3.626335 0.570232
H  3.199658 -1.038657 0.621077
H  2.210569 0.703894 1.966443
H  4.166468 3.07972 -0.28945
H  5.013133 1.801516 -1.149781
H  3.333453 2.146431 -1.524143
H  4.983207 1.89626 1.895062
H  4.52069 0.218174 2.173066
H  5.713875 0.609727 0.935642
H  2.779307 0.117974 -2.136695
H  -1.377359 2.51298 0.44484
H  0.988016 -1.838335 0.52339
H  1.052611 -3.207405 -0.584173
H  -0.337873 -2.150671 -0.596896
H  1.408718 -0.937696 -3.673717
H  -0.167023 -1.391109 -3.012915
H  1.063485 -2.614307 -3.237336
H  -0.637567 0.615823 -1.608822
H  -2.001131 1.717292 -1.682207
H  -1.478051 0.699655 3.170532
H  -2.492741 2.077311 2.795779
H  -3.228032 0.497916 3.111595
H  -4.660881 -1.468801 0.216561
H  -4.433083 -0.910047 1.869365
H  -2.510326 -2.468268 2.184336
H  -2.560714 -4.48763 0.839096
H  -3.767454 -3.71397 -0.322108
elementType: O C H
totalener: -965.41237184 hartree
nucrepener: 1911.95524884 hartree
electener: -2877.36762067 hartree
oneelecener: -5110.81350113 hartree
twoeener: 2233.44588046 hartree
cpcmener: -0.03627392 hartree
kineticenergy: 961.00349370 hartree
xcener: -95.141459590150 hartree
chargesum: 0.0000000
charge: -0.278622 -0.473689 -0.486689 0.141503 -0.028849 -0.121318 -0.292113 -0.271550 -0.221626 0.373286 -0.057715 0.261759 -0.266731 -0.223526 -0.164636 -0.038222 -0.067532 0.293616 -0.249792 -0.097230 -0.177192 -0.288442 0.107564 0.103557 0.102692 0.097739 0.083484 0.095783 0.087006 0.095654 0.129742 0.113514 0.093561 0.117608 0.070190 0.093327 0.080556 0.105244 0.108508 0.124613 0.110698 0.113709 0.101973 0.094316 0.112696 0.144237 0.133943 0.113392
qa: -0.2786 -0.4737 -0.4867 0.1415 -0.0288 -0.1213 -0.2921 -0.2716 -0.2216 0.3733 -0.0577 0.2618 -0.2667 -0.2235 -0.1646 -0.0382 -0.0675 0.2936 -0.2498 -0.0972 -0.1772 -0.2884 0.1076 0.1036 0.1027 0.0977 0.0835 0.0958 0.0870 0.0957 0.1297 0.1135 0.0936 0.1176 0.0702 0.0933 0.0806 0.1052 0.1085 0.1246 0.1107 0.1137 0.1020 0.0943 0.1127 0.1442 0.1339 0.1134
va: 2.1142 2.0172 1.9849 3.7620 3.7920 3.8335 3.8941 3.8976 3.7930 4.1632 3.7349 3.7338 3.9529 3.9055 3.9095 3.7940 3.5192 3.9680 3.9451 3.8531 3.7770 3.9348 1.0028 1.0259 1.0008 0.9998 1.0142 1.0025 1.0034 1.0022 0.9987 1.0167 1.0098 1.0013 0.9970 1.0063 1.0130 0.9963 1.0233 1.0171 1.0025 0.9987 1.0046 1.0227 1.0069 0.9987 1.0026 1.0159
dispcorr: -0.027678366 hartree
energy: -965.440050202174
dipole: 10.45657 -10.12691 0.32966 -7.01330 7.25543 0.24213 2.68744 -0.30098 2.38646
magnitude: 2.42126 au
magnitude: 6.15436 debye
