program: Orca
programVersion: 5.0.2
elementType: O O O C C C C C C C C C C C C C C C C C C C H H H H H H H H H H H H H H H H H H H H H H H H H H
charge: 0
multiplicity: 1
keywords: wb97x-d3
keywords: def2-TZVPP
keywords: def2/J RIJCOSX
keywords: DEFGRID2
keywords: scfconv7
keywords: smallprint printgap noloewdin
keywords: NOSOSCF
formula: C19H26O3
InChI: InChI=1/C19H26O3/c1-7-8-13-12(4)16(10-15(13)20)22-18(21)17-14(9-11(2)3)19(17,5)6/h7,9,14,16-17H,1,8,10H2,2-6H3
48 atoms
O  0.165451 1.037187 0.40088
O  0.590906 2.291892 2.199864
O  -3.47125 0.397386 -2.232372
C  3.219486 0.978349 0.099344
C  2.780358 -0.330763 0.669824
C  2.328376 0.957031 1.336509
C  2.693263 1.467058 -1.228022
C  4.646338 1.402984 0.35093
C  1.861761 -1.281402 -0.010653
C  0.956952 1.493725 1.362979
C  2.164201 -1.957303 -1.122347
C  -1.188606 1.495173 0.296759
C  3.457139 -1.809863 -1.863419
C  1.204764 -2.94044 -1.721034
C  -1.601753 1.516494 -1.16776
C  -2.117715 0.501768 0.950736
C  -3.037869 0.037219 0.090757
C  -2.806377 0.611268 -1.237184
C  -1.963323 0.130554 2.377062
C  -4.10919 -0.962954 0.355329
C  -3.639788 -2.388889 0.313798
C  -2.390095 -2.803351 0.143511
H  3.542016 -0.825489 1.269373
H  2.843998 1.19876 2.258617
H  2.566672 2.551344 -1.217688
H  3.418567 1.234685 -2.009451
H  1.749052 1.01768 -1.522433
H  5.307619 0.976879 -0.406712
H  4.746579 2.489009 0.304478
H  5.004471 1.07543 1.327433
H  0.911068 -1.489272 0.471079
H  -1.288406 2.477598 0.761847
H  4.159942 -1.135462 -1.378111
H  3.284032 -1.444393 -2.878785
H  3.94569 -2.782101 -1.967924
H  1.648147 -3.937585 -1.779997
H  0.946869 -2.657511 -2.744963
H  0.279836 -3.014897 -1.149866
H  -0.814424 1.130713 -1.818968
H  -1.85263 2.517181 -1.521251
H  -2.773836 -0.507708 2.723229
H  -1.027275 -0.411402 2.534317
H  -1.925797 1.018471 3.01002
H  -4.917946 -0.840121 -0.370654
H  -4.569892 -0.778886 1.330481
H  -4.425416 -3.126261 0.446421
H  -2.152524 -3.85918 0.136438
H  -1.560938 -2.118938 0.007118
elementType: O C H
totalener: -965.41153693 hartree
nucrepener: 1902.45243670 hartree
electener: -2867.86397363 hartree
oneelecener: -5090.84842871 hartree
twoeener: 2222.98445507 hartree
cpcmener: -0.03709987 hartree
kineticenergy: 961.00542376 hartree
xcener: -95.146345278188 hartree
chargesum: -0.0000000
charge: -0.268703 -0.503559 -0.483462 0.085158 0.009343 -0.108258 -0.289048 -0.275383 -0.276427 0.420866 -0.020202 0.228019 -0.268231 -0.226971 -0.146850 -0.042702 -0.090090 0.318613 -0.253028 -0.061233 -0.195878 -0.241923 0.116726 0.095337 0.116033 0.096812 0.089743 0.092009 0.098691 0.088714 0.116102 0.111703 0.093431 0.101107 0.107522 0.100313 0.095730 0.081680 0.103784 0.107406 0.104122 0.115216 0.123000 0.089630 0.104853 0.132880 0.136372 0.071033
qa: -0.2687 -0.5036 -0.4835 0.0852 0.0093 -0.1083 -0.2890 -0.2754 -0.2764 0.4209 -0.0202 0.2280 -0.2682 -0.2270 -0.1469 -0.0427 -0.0901 0.3186 -0.2530 -0.0612 -0.1959 -0.2419 0.1167 0.0953 0.1160 0.0968 0.0897 0.0920 0.0987 0.0887 0.1161 0.1117 0.0934 0.1011 0.1075 0.1003 0.0957 0.0817 0.1038 0.1074 0.1041 0.1152 0.1230 0.0896 0.1049 0.1329 0.1364 0.0710
va: 2.1161 1.9927 2.0161 3.7053 3.7651 3.8942 3.8941 3.9119 3.8609 4.1065 3.6929 3.7423 3.9365 3.9330 3.9069 3.7248 3.4306 4.0338 3.9401 3.8312 3.8951 3.8754 1.0041 1.0271 1.0009 0.9995 1.0074 1.0030 1.0005 1.0059 0.9995 1.0292 1.0062 0.9958 1.0008 0.9982 0.9973 1.0016 1.0280 1.0210 1.0049 0.9955 1.0063 1.0210 0.9991 1.0011 1.0007 1.0334
dispcorr: -0.027473754 hartree
energy: -965.439010688955
dipole: 15.68741 -14.32758 1.35982 -10.62433 10.03133 -0.59299 -4.05420 4.72218 0.66798
magnitude: 1.62695 au
magnitude: 4.13537 debye
