program: Orca
programVersion: 5.0.2
elementType: O O O C C C C C C C C C C C C C C C C C C C H H H H H H H H H H H H H H H H H H H H H H H H H H
charge: 0
multiplicity: 1
keywords: wb97x-d3
keywords: def2-TZVPP
keywords: def2/J RIJCOSX
keywords: DEFGRID2
keywords: scfconv7
keywords: smallprint printgap noloewdin
keywords: NOSOSCF
formula: C19H26O3
InChI: InChI=1/C19H26O3/c1-7-8-13-12(4)16(10-15(13)20)22-18(21)17-14(9-11(2)3)19(17,5)6/h7,9,14,16-17H,1,8,10H2,2-6H3
48 atoms
O  0.089832 0.919026 0.659518
O  1.018402 2.177488 -0.930014
O  -2.472053 -1.948468 -1.534224
C  3.757979 1.422478 0.307132
C  3.196167 0.031471 0.330865
C  2.365409 1.218128 0.82795
C  4.043816 2.117206 -1.002974
C  4.783242 1.749871 1.368729
C  2.800867 -0.687146 -0.907055
C  1.128797 1.519212 0.077149
C  1.974423 -1.737267 -0.948649
C  -1.189223 1.01099 0.015943
C  1.308531 -2.322046 0.258237
C  1.650965 -2.421244 -2.241415
C  -1.28395 0.145963 -1.235639
C  -2.172914 0.403616 0.984234
C  -2.712753 -0.728092 0.507375
C  -2.197045 -0.987747 -0.841201
C  -2.448624 1.069036 2.278449
C  -3.716839 -1.615314 1.156474
C  -5.143029 -1.234016 0.883735
C  -5.560268 -0.152977 0.236106
H  3.55096 -0.602081 1.138301
H  2.234163 1.260436 1.904565
H  5.06809 1.896132 -1.308978
H  3.391302 1.822162 -1.819632
H  3.964766 3.19946 -0.890401
H  4.804707 2.822242 1.572059
H  4.57321 1.237424 2.30859
H  5.782276 1.453367 1.04424
H  3.231997 -0.34236 -1.841986
H  -1.427306 2.060109 -0.17598
H  1.483656 -1.753219 1.169732
H  1.658384 -3.344463 0.428698
H  0.227972 -2.392765 0.106379
H  1.943434 -3.474035 -2.212103
H  2.150632 -1.955559 -3.090409
H  0.573761 -2.406375 -2.429477
H  -0.322541 -0.231352 -1.587595
H  -1.734335 0.696401 -2.064157
H  -3.141451 0.504595 2.899014
H  -1.528597 1.227304 2.844278
H  -2.877835 2.058041 2.100438
H  -3.563311 -1.637847 2.239257
H  -3.562159 -2.64612 0.824528
H  -5.879542 -1.927119 1.277914
H  -6.61702 0.036559 0.099126
H  -4.879123 0.579507 -0.180528
elementType: O C H
totalener: -965.41343594 hartree
nucrepener: 1890.80730873 hartree
electener: -2856.22074467 hartree
oneelecener: -5068.21281885 hartree
twoeener: 2211.99207418 hartree
cpcmener: -0.03693329 hartree
kineticenergy: 960.99934796 hartree
xcener: -95.142231085273 hartree
chargesum: -0.0000000
charge: -0.280432 -0.473498 -0.488542 0.142317 -0.034491 -0.122431 -0.294097 -0.270943 -0.218466 0.378064 -0.059103 0.268062 -0.275725 -0.220905 -0.170304 -0.032515 -0.098164 0.331210 -0.237725 -0.101482 -0.185073 -0.282063 0.107449 0.103792 0.097429 0.083322 0.102853 0.095674 0.087589 0.094663 0.127786 0.113070 0.091979 0.114374 0.091912 0.104374 0.091649 0.080800 0.108316 0.122565 0.098590 0.113010 0.114348 0.105642 0.093355 0.134076 0.133857 0.113832
qa: -0.2804 -0.4735 -0.4885 0.1423 -0.0345 -0.1224 -0.2941 -0.2709 -0.2185 0.3781 -0.0591 0.2681 -0.2757 -0.2209 -0.1703 -0.0325 -0.0982 0.3312 -0.2377 -0.1015 -0.1851 -0.2821 0.1074 0.1038 0.0974 0.0833 0.1029 0.0957 0.0876 0.0947 0.1278 0.1131 0.0920 0.1144 0.0919 0.1044 0.0916 0.0808 0.1083 0.1226 0.0986 0.1130 0.1143 0.1056 0.0934 0.1341 0.1339 0.1138
va: 2.1156 2.0191 1.9929 3.7572 3.8043 3.8409 3.8983 3.8975 3.7977 4.1496 3.7230 3.7181 3.9488 3.9088 3.8978 3.7696 3.5037 3.9491 3.9362 3.8389 3.8209 3.9046 1.0035 1.0260 1.0000 1.0128 1.0015 1.0023 1.0035 1.0023 0.9986 1.0192 1.0094 1.0013 0.9950 0.9965 1.0068 1.0091 1.0218 1.0191 1.0041 1.0060 0.9963 1.0004 1.0175 1.0023 1.0035 1.0137
dispcorr: -0.026951088 hartree
energy: -965.440387023907
dipole: 8.97609 -8.65671 0.31938 -1.89775 2.51971 0.62196 4.04333 -1.67412 2.36921
magnitude: 2.47022 au
magnitude: 6.27880 debye
