program: Orca
programVersion: 5.0.2
elementType: O O O C C C C C C C C C C C C C C C C C C C H H H H H H H H H H H H H H H H H H H H H H H H H H
charge: 0
multiplicity: 1
keywords: wb97x-d3
keywords: def2-TZVPP
keywords: def2/J RIJCOSX
keywords: DEFGRID2
keywords: scfconv7
keywords: smallprint printgap noloewdin
keywords: NOSOSCF
formula: C19H26O3
InChI: InChI=1/C19H26O3/c1-7-8-13-12(4)16(10-15(13)20)22-18(21)17-14(9-11(2)3)19(17,5)6/h7,9,14,16-17H,1,8,10H2,2-6H3
48 atoms
O  0.192977 0.863536 0.699233
O  0.685627 2.894945 1.463583
O  -4.003655 1.727996 -1.11278
C  2.91659 0.912936 -0.656829
C  3.137099 0.216887 0.64672
C  2.45039 1.572967 0.63502
C  1.936746 0.364569 -1.664818
C  4.109275 1.575791 -1.303485
C  2.460273 -1.045542 1.043451
C  1.044157 1.84293 0.97624
C  2.767992 -2.246748 0.546636
C  -1.19085 1.07613 0.990716
C  3.802081 -2.465715 -0.514804
C  2.08824 -3.489877 1.034492
C  -1.891312 2.042351 0.041834
C  -1.896825 -0.238238 0.800296
C  -2.997621 -0.107126 0.043213
C  -3.099331 1.273108 -0.439277
C  -1.380638 -1.474848 1.433634
C  -3.983236 -1.165966 -0.335323
C  -3.490001 -1.961544 -1.507867
C  -4.069992 -1.993968 -2.700859
H  4.153722 0.299843 1.024916
H  3.075958 2.39394 0.965065
H  1.445709 1.171903 -2.211319
H  2.479629 -0.23761 -2.395753
H  1.168321 -0.271291 -1.235133
H  3.798553 2.409395 -1.936083
H  4.811525 1.961021 -0.563537
H  4.645955 0.863432 -1.933627
H  1.718447 -0.994184 1.833645
H  -1.292919 1.392719 2.033152
H  3.367578 -2.966396 -1.383625
H  4.591303 -3.125986 -0.145588
H  4.271843 -1.545012 -0.856652
H  1.360143 -3.282039 1.818375
H  2.815407 -4.204931 1.427675
H  1.570209 -3.996476 0.216116
H  -1.262241 2.286153 -0.81831
H  -2.1841 2.981003 0.511291
H  -0.528185 -1.860493 0.868973
H  -1.029601 -1.282618 2.448443
H  -2.133314 -2.260742 1.467555
H  -4.947318 -0.710121 -0.567697
H  -4.142127 -1.834935 0.514578
H  -2.582894 -2.535026 -1.338082
H  -3.660076 -2.585745 -3.509287
H  -4.971652 -1.431952 -2.915109
elementType: O C H
totalener: -965.41265301 hartree
nucrepener: 1870.76215904 hartree
electener: -2836.17481205 hartree
oneelecener: -5027.22062600 hartree
twoeener: 2191.04581395 hartree
cpcmener: -0.03886043 hartree
kineticenergy: 961.00248364 hartree
xcener: -95.142693367543 hartree
chargesum: -0.0000000
charge: -0.279994 -0.503304 -0.484145 0.098415 0.003522 -0.101401 -0.296068 -0.273584 -0.303760 0.420520 0.005285 0.222986 -0.266774 -0.254731 -0.135981 -0.003633 -0.069817 0.307666 -0.319461 -0.096436 -0.184131 -0.286059 0.118500 0.094313 0.113603 0.098548 0.093766 0.099346 0.088922 0.091520 0.126118 0.114039 0.100202 0.107960 0.091047 0.090159 0.105978 0.100436 0.108720 0.104936 0.118373 0.126313 0.115123 0.085411 0.114730 0.145336 0.132194 0.115292
qa: -0.2800 -0.5033 -0.4841 0.0984 0.0035 -0.1014 -0.2961 -0.2736 -0.3038 0.4205 0.0053 0.2230 -0.2668 -0.2547 -0.1360 -0.0036 -0.0698 0.3077 -0.3195 -0.0964 -0.1841 -0.2861 0.1185 0.0943 0.1136 0.0985 0.0938 0.0993 0.0889 0.0915 0.1261 0.1140 0.1002 0.1080 0.0910 0.0902 0.1060 0.1004 0.1087 0.1049 0.1184 0.1263 0.1151 0.0854 0.1147 0.1453 0.1322 0.1153
va: 2.1185 1.9984 2.0121 3.6761 3.7723 3.8964 3.9005 3.9098 3.8712 4.1042 3.6494 3.7699 3.9408 3.9327 3.8987 3.7062 3.4555 4.0570 3.9583 3.8555 3.7905 3.9498 1.0034 1.0279 1.0012 0.9995 1.0060 1.0009 1.0057 1.0031 1.0067 1.0155 0.9971 1.0001 1.0059 1.0036 0.9991 0.9939 1.0194 1.0257 0.9870 0.9982 1.0062 1.0278 1.0039 0.9979 1.0021 1.0114
dispcorr: -0.026219550 hartree
energy: -965.438872559075
dipole: 15.53083 -13.54016 1.99068 -18.44778 15.91148 -2.53630 -6.16130 6.76362 0.60232
magnitude: 3.28000 au
magnitude: 8.33710 debye
