program: Orca
programVersion: 5.0.2
elementType: O O O C C C C C C C C C C C C C C C C C C C H H H H H H H H H H H H H H H H H H H H H H H H H H
charge: 0
multiplicity: 1
keywords: wb97x-d3
keywords: def2-TZVPP
keywords: def2/J RIJCOSX
keywords: DEFGRID2
keywords: scfconv7
keywords: smallprint printgap noloewdin
keywords: NOSOSCF
formula: C19H26O3
InChI: InChI=1/C19H26O3/c1-7-8-13-12(4)16(10-15(13)20)22-18(21)17-14(9-11(2)3)19(17,5)6/h7,9,14,16-17H,1,8,10H2,2-6H3
48 atoms
O  0.292433 0.720357 0.528444
O  0.521378 2.577125 1.73426
O  -3.946046 1.647795 -1.211045
C  3.11765 1.134087 -0.459856
C  3.266838 0.306076 0.773877
C  2.467372 1.600201 0.835633
C  2.300357 0.654834 -1.634828
C  4.314451 1.954524 -0.882358
C  2.647349 -1.029488 0.975387
C  1.018097 1.68403 1.079308
C  3.009002 -2.139114 0.325748
C  -1.118563 0.727204 0.757674
C  4.062008 -2.172877 -0.737651
C  2.370451 -3.460499 0.627479
C  -1.8750 1.839127 0.040542
C  -1.680702 -0.552479 0.195574
C  -2.757968 -0.323905 -0.572506
C  -2.99992 1.11841 -0.660745
C  -1.092239 -1.861687 0.563796
C  -3.680734 -1.318905 -1.199906
C  -4.787323 -1.67525 -0.250803
C  -6.067717 -1.381349 -0.439681
H  4.228849 0.418305 1.269388
H  2.976895 2.42241 1.323766
H  2.973919 0.263045 -2.3990
H  1.596493 -0.135825 -1.39215
H  1.745756 1.479055 -2.087254
H  4.008395 2.820135 -1.472918
H  4.882968 2.318618 -0.02592
H  4.987374 1.35383 -1.497894
H  1.894328 -1.1153 1.753085
H  -1.30405 0.753103 1.836148
H  4.84759 -2.884684 -0.470965
H  4.533404 -1.206648 -0.908067
H  3.644675 -2.517757 -1.68698
H  1.890309 -3.872975 -0.263715
H  1.617955 -3.386893 1.412385
H  3.117065 -4.193992 0.942263
H  -1.249428 2.329217 -0.710288
H  -2.255287 2.611544 0.70793
H  -1.690049 -2.697378 0.205837
H  -0.085894 -1.965824 0.151687
H  -0.997769 -1.946163 1.648989
H  -3.125353 -2.218818 -1.473299
H  -4.097477 -0.908883 -2.121882
H  -4.484124 -2.195589 0.65334
H  -6.823127 -1.660964 0.283497
H  -6.409342 -0.859348 -1.326035
elementType: O C H
totalener: -965.41270998 hartree
nucrepener: 1861.55502136 hartree
electener: -2826.96773134 hartree
oneelecener: -5008.82337189 hartree
twoeener: 2181.85564055 hartree
cpcmener: -0.03944170 hartree
kineticenergy: 961.00695010 hartree
xcener: -95.144695007832 hartree
chargesum: 0.0000000
charge: -0.279210 -0.504864 -0.485417 0.098093 0.010549 -0.103324 -0.295326 -0.275869 -0.297633 0.423120 0.001297 0.213015 -0.265700 -0.257938 -0.133665 -0.008247 -0.066373 0.307525 -0.285085 -0.102590 -0.182197 -0.286179 0.115865 0.092432 0.096815 0.094549 0.115305 0.099760 0.089005 0.090967 0.120238 0.113464 0.107441 0.092193 0.101431 0.100554 0.090869 0.108900 0.111068 0.101120 0.108898 0.107511 0.122054 0.111931 0.091992 0.145074 0.131937 0.114645
qa: -0.2792 -0.5049 -0.4854 0.0981 0.0105 -0.1033 -0.2953 -0.2759 -0.2976 0.4231 0.0013 0.2130 -0.2657 -0.2579 -0.1337 -0.0082 -0.0664 0.3075 -0.2851 -0.1026 -0.1822 -0.2862 0.1159 0.0924 0.0968 0.0945 0.1153 0.0998 0.0890 0.0910 0.1202 0.1135 0.1074 0.0922 0.1014 0.1006 0.0909 0.1089 0.1111 0.1011 0.1089 0.1075 0.1221 0.1119 0.0920 0.1451 0.1319 0.1146
va: 2.1216 1.9981 2.0077 3.6730 3.7747 3.8974 3.8960 3.9125 3.8750 4.0963 3.6402 3.7894 3.9375 3.9319 3.9118 3.7183 3.4602 4.0595 3.9619 3.8617 3.7861 3.9551 1.0044 1.0282 0.9994 1.0033 1.0014 1.0002 1.0058 1.0032 1.0096 1.0138 1.0008 1.0053 0.9962 0.9928 1.0030 0.9994 1.0179 1.0276 1.0083 0.9940 0.9947 1.0038 1.0229 0.9991 1.0023 1.0122
dispcorr: -0.026300643 hartree
energy: -965.439010625590
dipole: 15.63456 -13.27239 2.36217 -16.12970 13.57548 -2.55422 -5.53908 5.54317 0.00409
magnitude: 3.47907 au
magnitude: 8.84310 debye
