program: Orca
programVersion: 5.0.2
elementType: O O O C C C C C C C C C C C C C C C C C C C H H H H H H H H H H H H H H H H H H H H H H H H H H
charge: 0
multiplicity: 1
keywords: wb97x-d3
keywords: def2-TZVPP
keywords: def2/J RIJCOSX
keywords: DEFGRID2
keywords: scfconv7
keywords: smallprint printgap noloewdin
keywords: NOSOSCF
formula: C19H26O3
InChI: InChI=1/C19H26O3/c1-7-8-13-12(4)16(10-15(13)20)22-18(21)17-14(9-11(2)3)19(17,5)6/h7,9,14,16-17H,1,8,10H2,2-6H3
48 atoms
O  0.376533 1.237473 0.330873
O  0.809029 1.546636 2.502852
O  -3.503399 0.947157 -2.065486
C  3.342225 1.578448 -0.210972
C  3.080254 0.123366 -0.021152
C  2.613784 1.130812 1.044075
C  2.661782 2.373921 -1.298146
C  4.755349 2.053469 0.039763
C  2.133969 -0.640968 -0.867247
C  1.194503 1.336182 1.371253
C  1.760959 -1.90702 -0.657798
C  -1.042135 1.222721 0.514305
C  2.226306 -2.738256 0.498102
C  0.802964 -2.590603 -1.585008
C  -1.722515 1.856201 -0.690452
C  -1.536258 -0.204297 0.537254
C  -2.458036 -0.428076 -0.413404
C  -2.681227 0.799781 -1.181685
C  -1.051947 -1.166067 1.555287
C  -3.224747 -1.690259 -0.658691
C  -4.327927 -1.857794 0.343638
C  -4.432215 -2.881273 1.18212
H  3.93251 -0.449735 0.330941
H  3.219611 1.148926 1.942379
H  2.573588 3.420593 -1.002123
H  3.273635 2.342315 -2.201495
H  1.670054 2.023362 -1.567095
H  4.767048 3.103352 0.338262
H  5.245941 1.477294 0.824968
H  5.355331 1.958263 -0.867128
H  1.732352 -0.136011 -1.739466
H  -1.308341 1.732714 1.44209
H  2.787876 -2.172358 1.239189
H  2.859028 -3.560468 0.152865
H  1.375688 -3.19945 1.005462
H  -0.108266 -2.882012 -1.053801
H  1.229648 -3.511987 -1.990065
H  0.51401 -1.955216 -2.422095
H  -1.007485 2.092628 -1.481707
H  -2.250995 2.777451 -0.444575
H  -1.345539 -0.833967 2.554058
H  -1.451547 -2.165679 1.399764
H  0.0369 -1.235996 1.556595
H  -2.55465 -2.552181 -0.624853
H  -3.648149 -1.65896 -1.666194
H  -5.071366 -1.066431 0.369252
H  -5.247898 -2.950207 1.890309
H  -3.710834 -3.690386 1.187701
elementType: O C H
totalener: -965.41198086 hartree
nucrepener: 1905.96974544 hartree
electener: -2871.38172630 hartree
oneelecener: -5097.62314729 hartree
twoeener: 2226.24142100 hartree
cpcmener: -0.03673433 hartree
kineticenergy: 961.00056187 hartree
xcener: -95.144706040823 hartree
chargesum: -0.0000000
charge: -0.265483 -0.503437 -0.487396 0.134011 -0.034953 -0.117614 -0.279342 -0.266606 -0.239072 0.407149 -0.042062 0.235161 -0.275851 -0.244786 -0.154101 -0.044153 -0.085182 0.338920 -0.277761 -0.084517 -0.190894 -0.284912 0.113177 0.092206 0.103558 0.100536 0.080546 0.096023 0.088719 0.094866 0.123773 0.115403 0.095711 0.114084 0.094205 0.083113 0.110014 0.094434 0.106651 0.103640 0.136854 0.106617 0.114378 0.103159 0.096968 0.144320 0.133318 0.116608
qa: -0.2655 -0.5034 -0.4874 0.1340 -0.0350 -0.1176 -0.2793 -0.2666 -0.2391 0.4071 -0.0421 0.2352 -0.2759 -0.2448 -0.1541 -0.0442 -0.0852 0.3389 -0.2778 -0.0845 -0.1909 -0.2849 0.1132 0.0922 0.1036 0.1005 0.0805 0.0960 0.0887 0.0949 0.1238 0.1154 0.0957 0.1141 0.0942 0.0831 0.1100 0.0944 0.1067 0.1036 0.1369 0.1066 0.1144 0.1032 0.0970 0.1443 0.1333 0.1166
va: 2.1034 1.9908 2.0093 3.7733 3.7730 3.8776 3.8984 3.8971 3.8141 4.1224 3.6946 3.7363 3.9301 3.9260 3.9566 3.6913 3.4201 4.0270 3.9458 3.8666 3.7920 3.9367 1.0015 1.0285 1.0001 0.9996 1.0125 1.0019 1.0050 1.0021 1.0018 1.0301 1.0039 0.9981 0.9953 0.9934 0.9989 1.0057 1.0225 1.0228 1.0008 1.0008 0.9948 1.0060 1.0246 1.0050 1.0033 1.0079
dispcorr: -0.027666341 hartree
energy: -965.439647199721
dipole: 11.95330 -10.23640 1.71689 -11.47864 10.52340 -0.95524 -1.20606 1.48039 0.27433
magnitude: 1.98380 au
magnitude: 5.04242 debye
