program: Orca
programVersion: 5.0.2
elementType: O O O C C C C C C C C C C C C C C C C C C C H H H H H H H H H H H H H H H H H H H H H H H H H H
charge: 0
multiplicity: 1
keywords: wb97x-d3
keywords: def2-TZVPP
keywords: def2/J RIJCOSX
keywords: DEFGRID2
keywords: scfconv7
keywords: smallprint printgap noloewdin
keywords: NOSOSCF
formula: C19H26O3
InChI: InChI=1/C19H26O3/c1-7-8-13-12(4)16(10-15(13)20)22-18(21)17-14(9-11(2)3)19(17,5)6/h7,9,14,16-17H,1,8,10H2,2-6H3
48 atoms
O  -0.141784 0.361684 0.399075
O  1.086985 -1.381703 -0.287134
O  -4.497513 0.610231 1.8155
C  3.167399 0.780349 -1.142865
C  3.510585 0.418554 0.256836
C  2.067175 0.799687 -0.092929
C  3.188171 -0.254725 -2.238803
C  3.587101 2.14855 -1.626682
C  3.878385 -0.955759 0.672932
C  0.997108 -0.203842 -0.024397
C  3.71024 -1.421541 1.913021
C  -1.310467 -0.443619 0.581779
C  3.069856 -0.60121 2.994459
C  4.095772 -2.817753 2.288591
C  -2.12762 0.091145 1.74955
C  -2.223631 -0.336227 -0.615222
C  -3.463045 0.041987 -0.262568
C  -3.509854 0.292918 1.180365
C  -1.736821 -0.661902 -1.976141
C  -4.649283 0.245099 -1.151391
C  -4.642095 1.622376 -1.746012
C  -4.593275 1.877637 -3.047653
H  3.993165 1.2059 0.831361
H  1.761407 1.787372 0.230398
H  2.481576 0.010304 -3.027271
H  4.182593 -0.282791 -2.688133
H  2.953199 -1.261758 -1.906674
H  2.924453 2.504355 -2.417681
H  3.574574 2.885601 -0.822975
H  4.600382 2.115479 -2.031567
H  4.315759 -1.607961 -0.07685
H  -1.024152 -1.485459 0.740176
H  3.305904 0.459848 2.912908
H  3.379282 -0.936895 3.984699
H  1.980209 -0.691371 2.955241
H  3.231094 -3.369982 2.666306
H  4.835736 -2.818803 3.092883
H  4.508586 -3.372539 1.446299
H  -1.742307 1.049142 2.105746
H  -2.150676 -0.587355 2.602589
H  -0.960617 0.040503 -2.289251
H  -1.288939 -1.656898 -1.99682
H  -2.532427 -0.626231 -2.717326
H  -5.561353 0.104875 -0.564672
H  -4.665094 -0.503785 -1.945076
H  -4.666847 2.44647 -1.038947
H  -4.585593 2.892392 -3.42423
H  -4.565478 1.083234 -3.784736
elementType: O C H
totalener: -965.41420441 hartree
nucrepener: 1823.37197443 hartree
electener: -2788.78617883 hartree
oneelecener: -4933.21027409 hartree
twoeener: 2144.42409525 hartree
cpcmener: -0.03599066 hartree
kineticenergy: 960.99799542 hartree
xcener: -95.140698818847 hartree
chargesum: 0.0000000
charge: -0.304107 -0.495830 -0.488918 0.120569 -0.023912 -0.076566 -0.293881 -0.263116 -0.277901 0.390584 -0.016725 0.260224 -0.279051 -0.224162 -0.141171 -0.048553 -0.067367 0.320651 -0.253712 -0.099116 -0.185393 -0.287614 0.115414 0.091388 0.099642 0.101746 0.091912 0.096603 0.088448 0.094180 0.127390 0.105377 0.099923 0.103147 0.102980 0.098966 0.095327 0.087874 0.101712 0.102107 0.116780 0.119108 0.099423 0.096610 0.105106 0.145624 0.132285 0.115991
qa: -0.3041 -0.4958 -0.4889 0.1206 -0.0239 -0.0766 -0.2939 -0.2631 -0.2779 0.3906 -0.0167 0.2602 -0.2791 -0.2242 -0.1412 -0.0486 -0.0674 0.3207 -0.2537 -0.0991 -0.1854 -0.2876 0.1154 0.0914 0.0996 0.1017 0.0919 0.0966 0.0884 0.0942 0.1274 0.1054 0.0999 0.1031 0.1030 0.0990 0.0953 0.0879 0.1017 0.1021 0.1168 0.1191 0.0994 0.0966 0.1051 0.1456 0.1323 0.1160
va: 2.1148 1.9813 2.0046 3.7714 3.8118 3.8576 3.8963 3.8956 3.8260 4.0609 3.7045 3.7516 3.9528 3.9267 3.9199 3.7887 3.4444 4.0375 3.9360 3.8564 3.7933 3.9421 1.0030 1.0323 1.0014 0.9986 1.0161 1.0021 1.0051 1.0022 0.9989 1.0281 0.9997 1.0030 0.9971 0.9939 0.9959 1.0074 1.0295 1.0224 0.9978 1.0064 1.0079 1.0235 1.0044 1.0029 1.0031 1.0091
dispcorr: -0.023636311 hartree
energy: -965.437840719062
dipole: 17.27774 -15.59476 1.68298 -0.60775 0.85081 0.24306 -6.38075 5.52397 -0.85677
magnitude: 1.90409 au
magnitude: 4.83980 debye
