program: Orca
programVersion: 5.0.2
elementType: O O O C C C C C C C C C C C C C C C C C C C H H H H H H H H H H H H H H H H H H H H H H H H H H
charge: 0
multiplicity: 1
keywords: wb97x-d3
keywords: def2-TZVPP
keywords: def2/J RIJCOSX
keywords: DEFGRID2
keywords: scfconv7
keywords: smallprint printgap noloewdin
keywords: NOSOSCF
formula: C19H26O3
InChI: InChI=1/C19H26O3/c1-7-8-13-12(4)16(10-15(13)20)22-18(21)17-14(9-11(2)3)19(17,5)6/h7,9,14,16-17H,1,8,10H2,2-6H3
48 atoms
O  0.34683 1.195593 0.366001
O  0.968507 1.891583 2.397274
O  -3.757783 0.898569 -1.647153
C  3.23345 1.425376 -0.508101
C  3.052946 0.036206 0.000227
C  2.642917 1.229793 0.878299
C  2.423824 1.961392 -1.66358
C  4.643045 1.972463 -0.500212
C  2.068267 -0.917138 -0.561639
C  1.253374 1.477578 1.292481
C  1.797293 -2.121899 -0.050655
C  -1.049235 1.333937 0.643156
C  2.420844 -2.660742 1.199719
C  0.798637 -3.030997 -0.698089
C  -1.776062 1.827304 -0.599567
C  -1.653136 -0.017414 0.942537
C  -2.702248 -0.277098 0.144693
C  -2.874632 0.817858 -0.815243
C  -1.104246 -0.8623 2.028875
C  -3.591718 -1.478097 0.115514
C  -3.164045 -2.418284 -0.9723
C  -3.859078 -2.669796 -2.074184
H  3.959708 -0.427726 0.37568
H  3.327169 1.443116 1.690833
H  2.96569 1.778841 -2.593496
H  1.437632 1.521186 -1.774402
H  2.29593 3.041087 -1.569375
H  5.162475 1.699109 -1.420614
H  4.639318 3.061818 -0.431802
H  5.225428 1.586486 0.337082
H  1.550434 -0.624126 -1.469001
H  -1.199924 2.006471 1.489731
H  1.649188 -2.999486 1.893972
H  3.041417 -1.936922 1.723064
H  3.038024 -3.534807 0.979722
H  -0.03539 -3.230394 -0.018967
H  1.240934 -4.002132 -0.93464
H  0.392083 -2.610373 -1.617634
H  -1.119266 1.835673 -1.472625
H  -2.182929 2.832638 -0.488973
H  -0.075976 -1.158005 1.807097
H  -1.074948 -0.307923 2.969032
H  -1.686074 -1.768732 2.181014
H  -4.625356 -1.165104 -0.046511
H  -3.559068 -1.990028 1.079161
H  -2.200099 -2.897292 -0.828628
H  -3.492044 -3.356692 -2.825811
H  -4.823751 -2.212433 -2.26019
elementType: O C H
totalener: -965.41277202 hartree
nucrepener: 1904.84163070 hartree
electener: -2870.25440272 hartree
oneelecener: -5095.52396673 hartree
twoeener: 2225.26956401 hartree
cpcmener: -0.03850647 hartree
kineticenergy: 961.01620163 hartree
xcener: -95.147680735971 hartree
chargesum: 0.0000000
charge: -0.267040 -0.505310 -0.484989 0.137374 -0.034758 -0.125907 -0.280266 -0.267634 -0.241595 0.426137 -0.046657 0.226221 -0.259659 -0.257356 -0.148832 -0.040556 -0.070635 0.317282 -0.260609 -0.080407 -0.203728 -0.285704 0.112647 0.092746 0.099546 0.079192 0.104646 0.095239 0.096417 0.089524 0.126261 0.113770 0.092860 0.092190 0.110876 0.092483 0.110116 0.093897 0.106117 0.104057 0.100294 0.126312 0.110514 0.099249 0.109790 0.151321 0.131180 0.113383
qa: -0.2670 -0.5053 -0.4850 0.1374 -0.0348 -0.1259 -0.2803 -0.2676 -0.2416 0.4261 -0.0467 0.2262 -0.2597 -0.2574 -0.1488 -0.0406 -0.0706 0.3173 -0.2606 -0.0804 -0.2037 -0.2857 0.1126 0.0927 0.0995 0.0792 0.1046 0.0952 0.0964 0.0895 0.1263 0.1138 0.0929 0.0922 0.1109 0.0925 0.1101 0.0939 0.1061 0.1041 0.1003 0.1263 0.1105 0.0992 0.1098 0.1513 0.1312 0.1134
va: 2.1068 1.9911 2.0086 3.7652 3.7729 3.8816 3.8972 3.8978 3.8119 4.1102 3.7120 3.7451 3.9297 3.9284 3.9443 3.7240 3.4187 4.0464 3.9393 3.8381 3.7795 3.9588 1.0018 1.0280 1.0005 1.0131 0.9993 1.0019 1.0019 1.0049 1.0016 1.0304 0.9975 1.0060 0.9974 0.9914 0.9984 1.0052 1.0239 1.0228 0.9948 1.0064 1.0048 1.0184 1.0088 1.0024 1.0032 1.0124
dispcorr: -0.027338576 hartree
energy: -965.440110596893
dipole: 12.50282 -10.77010 1.73273 -12.34433 11.32447 -1.01986 -3.02767 3.54512 0.51745
magnitude: 2.07611 au
magnitude: 5.27704 debye
