program: Orca
programVersion: 5.0.2
elementType: O O O C C C C C C C C C C C C C C C C C C C H H H H H H H H H H H H H H H H H H H H H H H H H H
charge: 0
multiplicity: 1
keywords: wb97x-d3
keywords: def2-TZVPP
keywords: def2/J RIJCOSX
keywords: DEFGRID2
keywords: scfconv7
keywords: smallprint printgap noloewdin
keywords: NOSOSCF
formula: C19H26O3
InChI: InChI=1/C19H26O3/c1-7-8-13-12(4)16(10-15(13)20)22-18(21)17-14(9-11(2)3)19(17,5)6/h7,9,14,16-17H,1,8,10H2,2-6H3
48 atoms
O  0.023443 1.599808 1.334058
O  0.150489 0.675631 -0.698331
O  -3.904485 1.687498 -1.208941
C  3.182878 1.309962 -0.582902
C  3.025343 0.000437 0.108248
C  2.147658 1.196732 0.51964
C  2.786956 1.490036 -2.027265
C  4.393818 2.13448 -0.210386
C  2.450692 -1.196551 -0.548523
C  0.701417 1.124416 0.280522
C  2.116618 -2.326118 0.083741
C  -1.404803 1.511508 1.347594
C  2.240133 -2.519071 1.56383
C  1.574257 -3.504664 -0.665505
C  -2.139414 2.360226 0.314482
C  -1.914733 0.108544 1.13844
C  -2.900952 0.065638 0.22932
C  -3.098096 1.396965 -0.344789
C  -1.33489 -1.032135 1.885539
C  -3.609758 -1.152559 -0.270701
C  -2.768636 -1.824927 -1.316903
C  -2.226992 -3.030787 -1.189333
H  3.777265 -0.213177 0.861425
H  2.419081 1.66004 1.460648
H  2.52332 2.531421 -2.219641
H  3.637332 1.246132 -2.666718
H  1.951428 0.87469 -2.346243
H  4.67851 1.993169 0.832795
H  5.24902 1.85598 -0.829069
H  4.204255 3.198256 -0.364959
H  2.319156 -1.159584 -1.625004
H  -1.656977 1.832487 2.359986
H  2.487282 -1.604252 2.100061
H  3.009355 -3.261562 1.794224
H  1.306902 -2.906626 1.979972
H  1.521453 -3.322889 -1.738795
H  0.569938 -3.756559 -0.31384
H  2.18981 -4.393122 -0.501771
H  -1.479302 2.808869 -0.428995
H  -2.694546 3.177973 0.776796
H  -1.018095 -0.739284 2.886582
H  -2.035983 -1.861282 1.969102
H  -0.45081 -1.411041 1.364283
H  -4.576593 -0.868053 -0.6942
H  -3.809295 -1.844918 0.549578
H  -2.585858 -1.249884 -2.220258
H  -1.614298 -3.45867 -1.972693
H  -2.385683 -3.637927 -0.305249
elementType: O C H
totalener: -965.41233695 hartree
nucrepener: 1916.21004924 hartree
electener: -2881.62238619 hartree
oneelecener: -5119.71008067 hartree
twoeener: 2238.08769448 hartree
cpcmener: -0.03958486 hartree
kineticenergy: 961.00469034 hartree
xcener: -95.145882442354 hartree
chargesum: 0.0000000
charge: -0.306743 -0.494295 -0.492995 0.138000 -0.038194 -0.092847 -0.298515 -0.262039 -0.249107 0.394979 -0.027659 0.305874 -0.280356 -0.246869 -0.156363 0.010491 -0.150345 0.305227 -0.271265 -0.082033 -0.170084 -0.314316 0.113619 0.092612 0.102495 0.100988 0.091475 0.088744 0.095061 0.096144 0.128345 0.119058 0.095119 0.114101 0.094680 0.096170 0.089113 0.107027 0.112290 0.113038 0.124728 0.118621 0.086026 0.095578 0.103224 0.144503 0.135075 0.121619
qa: -0.3067 -0.4943 -0.4930 0.1380 -0.0382 -0.0928 -0.2985 -0.2620 -0.2491 0.3950 -0.0277 0.3059 -0.2804 -0.2469 -0.1564 0.0105 -0.1503 0.3052 -0.2713 -0.0820 -0.1701 -0.3143 0.1136 0.0926 0.1025 0.1010 0.0915 0.0887 0.0951 0.0961 0.1283 0.1191 0.0951 0.1141 0.0947 0.0962 0.0891 0.1070 0.1123 0.1130 0.1247 0.1186 0.0860 0.0956 0.1032 0.1445 0.1351 0.1216
va: 2.1288 1.9962 1.9995 3.7679 3.7909 3.8699 3.8936 3.8926 3.8313 4.0781 3.6857 3.7567 3.9404 3.9303 3.8653 3.6559 3.5030 4.0498 3.9442 3.8555 3.7628 3.9361 1.0027 1.0324 0.9992 0.9989 1.0205 1.0046 1.0022 1.0024 1.0011 0.9907 1.0044 0.9978 0.9943 1.0057 0.9894 0.9975 1.0263 1.0189 1.0063 1.0007 0.9986 1.0232 1.0124 1.0032 1.0009 1.0061
dispcorr: -0.027156996 hartree
energy: -965.439493948282
dipole: 16.66517 -14.66784 1.99732 -13.72223 13.11997 -0.60225 1.03338 1.52574 2.55912
magnitude: 3.30168 au
magnitude: 8.39221 debye
