program: Orca
programVersion: 5.0.2
elementType: O O O C C C C C C C C C C C C C C C C C C C H H H H H H H H H H H H H H H H H H H H H H H H H H
charge: 0
multiplicity: 1
keywords: wb97x-d3
keywords: def2-TZVPP
keywords: def2/J RIJCOSX
keywords: DEFGRID2
keywords: scfconv7
keywords: smallprint printgap noloewdin
keywords: NOSOSCF
formula: C19H26O3
InChI: InChI=1/C19H26O3/c1-7-8-13-12(4)16(10-15(13)20)22-18(21)17-14(9-11(2)3)19(17,5)6/h7,9,14,16-17H,1,8,10H2,2-6H3
48 atoms
O  0.295192 1.122091 0.310027
O  0.922174 1.73281 2.366551
O  -3.99203 1.185892 -1.468308
C  3.182517 1.383147 -0.561367
C  3.043945 -0.014864 -0.066266
C  2.598949 1.154672 0.822722
C  2.352094 1.902812 -1.709707
C  4.573448 1.975731 -0.547426
C  2.101641 -1.004974 -0.640367
C  1.206803 1.36963 1.244244
C  1.819022 -2.181087 -0.072327
C  -1.093379 1.299846 0.60262
C  2.357826 -2.597054 1.263094
C  0.933876 -3.184916 -0.743375
C  -1.823298 1.858501 -0.60956
C  -1.758068 -0.025556 0.877197
C  -2.879705 -0.172412 0.153214
C  -3.039987 0.976966 -0.741102
C  -1.196199 -0.96925 1.870672
C  -3.839305 -1.310028 0.158287
C  -3.527366 -2.371677 -0.856371
C  -2.475813 -2.401178 -1.666021
H  3.964359 -0.453211 0.308575
H  3.278074 1.374146 1.637916
H  2.141966 2.965936 -1.580935
H  2.91898 1.793951 -2.636354
H  1.404085 1.392425 -1.852312
H  5.10278 1.727971 -1.469474
H  4.533994 3.063753 -0.469315
H  5.167252 1.601865 0.287414
H  1.660885 -0.780667 -1.60675
H  -1.21114 1.955698 1.467363
H  3.162994 -3.328022 1.148562
H  1.581911 -3.085455 1.856203
H  2.745876 -1.763812 1.846983
H  0.039336 -3.379684 -0.145018
H  1.446395 -4.144493 -0.852286
H  0.615034 -2.858875 -1.733129
H  -1.219229 1.754927 -1.514894
H  -2.094272 2.909416 -0.51211
H  -0.211647 -1.320006 1.552159
H  -1.056936 -0.478896 2.836191
H  -1.830509 -1.841327 2.01395
H  -4.852041 -0.939109 -0.02653
H  -3.881577 -1.773562 1.147578
H  -4.24895 -3.181495 -0.90095
H  -2.333098 -3.218022 -2.361475
H  -1.719133 -1.62539 -1.669544
elementType: O C H
totalener: -965.41295208 hartree
nucrepener: 1915.22602678 hartree
electener: -2880.63897886 hartree
oneelecener: -5116.31806788 hartree
twoeener: 2235.67908901 hartree
cpcmener: -0.03749210 hartree
kineticenergy: 961.00861635 hartree
xcener: -95.148466832068 hartree
chargesum: 0.0000000
charge: -0.270530 -0.504197 -0.483097 0.146993 -0.036344 -0.139529 -0.283329 -0.268638 -0.258689 0.432401 -0.023655 0.211286 -0.280591 -0.247526 -0.131474 -0.009550 -0.101848 0.318975 -0.239476 -0.079013 -0.177669 -0.292478 0.114386 0.093450 0.106551 0.099114 0.077876 0.094716 0.096719 0.088944 0.130240 0.112876 0.116994 0.095485 0.097843 0.086555 0.111127 0.092980 0.105866 0.101497 0.084667 0.125688 0.110244 0.092451 0.102885 0.133040 0.138649 0.107135
qa: -0.2705 -0.5042 -0.4831 0.1470 -0.0363 -0.1395 -0.2833 -0.2686 -0.2587 0.4324 -0.0237 0.2113 -0.2806 -0.2475 -0.1315 -0.0095 -0.1018 0.3190 -0.2395 -0.0790 -0.1777 -0.2925 0.1144 0.0935 0.1066 0.0991 0.0779 0.0947 0.0967 0.0889 0.1302 0.1129 0.1170 0.0955 0.0978 0.0866 0.1111 0.0930 0.1059 0.1015 0.0847 0.1257 0.1102 0.0925 0.1029 0.1330 0.1386 0.1071
va: 2.1122 1.9904 2.0137 3.7448 3.7909 3.8832 3.8995 3.8991 3.8180 4.1012 3.6819 3.7536 3.9303 3.9279 3.9082 3.6920 3.4265 4.0329 3.9299 3.8471 3.8279 3.9031 1.0014 1.0281 0.9989 1.0010 1.0127 1.0020 1.0015 1.0052 0.9989 1.0331 0.9960 0.9975 1.0023 0.9951 0.9984 1.0024 1.0219 1.0246 1.0027 1.0088 1.0052 1.0168 1.0021 1.0026 1.0015 1.0122
dispcorr: -0.028103040 hartree
energy: -965.441055120129
dipole: 14.02493 -12.27406 1.75087 -12.65829 11.45376 -1.20452 -3.12400 3.47134 0.34735
magnitude: 2.15338 au
magnitude: 5.47346 debye
