program: Orca
programVersion: 5.0.2
elementType: O O O C C C C C C C C C C C C C C C C C C C H H H H H H H H H H H H H H H H H H H H H H H H H H
charge: 0
multiplicity: 1
keywords: wb97x-d3
keywords: def2-TZVPP
keywords: def2/J RIJCOSX
keywords: DEFGRID2
keywords: scfconv7
keywords: smallprint printgap noloewdin
keywords: NOSOSCF
formula: C19H26O3
InChI: InChI=1/C19H26O3/c1-7-8-13-12(4)16(10-15(13)20)22-18(21)17-14(9-11(2)3)19(17,5)6/h7,9,14,16-17H,1,8,10H2,2-6H3
48 atoms
O  -0.405004 0.392923 0.443675
O  0.632021 -1.585253 0.293592
O  -4.74822 1.487293 1.389883
C  2.837523 0.130334 -1.139865
C  3.280645 0.068081 0.287447
C  1.841771 0.468089 -0.042695
C  2.697815 -1.125105 -1.963768
C  3.304093 1.315096 -1.951969
C  3.634228 -1.185666 0.980219
C  0.671956 -0.376607 0.245762
C  4.668312 -1.353035 1.81356
C  -1.675186 -0.209711 0.71182
C  5.657463 -0.295999 2.200546
C  4.915346 -2.68503 2.45715
C  -2.47628 0.679266 1.651614
C  -2.498359 -0.285057 -0.551768
C  -3.694677 0.305542 -0.400711
C  -3.782977 0.905082 0.933608
C  -1.978697 -0.967471 -1.760675
C  -4.795077 0.429513 -1.396519
C  -4.713818 1.661946 -2.250296
C  -3.730517 2.553665 -2.2602
H  3.853516 0.93206 0.604462
H  1.638057 1.526175 0.069262
H  3.635287 -1.312198 -2.490588
H  2.469536 -2.017689 -1.38876
H  1.918214 -1.005149 -2.718594
H  2.611658 1.525238 -2.769251
H  3.387358 2.216454 -1.343916
H  4.284376 1.116593 -2.389374
H  3.010127 -2.050594 0.793383
H  -1.535316 -1.209229 1.128455
H  5.601771 -0.092644 3.273391
H  5.529799 0.649441 1.677447
H  6.675997 -0.642862 2.008385
H  5.898301 -3.077678 2.184064
H  4.166344 -3.425214 2.176672
H  4.911852 -2.597749 3.546945
H  -1.983663 1.641074 1.811162
H  -2.639292 0.230798 2.631821
H  -1.08672 -0.461681 -2.138582
H  -1.685551 -1.993351 -1.530543
H  -2.710736 -0.989442 -2.565325
H  -5.759459 0.428019 -0.879946
H  -4.820554 -0.446101 -2.051173
H  -5.556655 1.802991 -2.919721
H  -3.766315 3.40839 -2.923172
H  -2.859905 2.473881 -1.620106
elementType: O C H
totalener: -965.41581901 hartree
nucrepener: 1801.03354036 hartree
electener: -2766.44935937 hartree
oneelecener: -4888.44542350 hartree
twoeener: 2121.99606413 hartree
cpcmener: -0.03627200 hartree
kineticenergy: 960.98836743 hartree
xcener: -95.142304013023 hartree
chargesum: -0.0000000
charge: -0.298829 -0.494433 -0.484162 0.107840 0.025898 -0.085652 -0.286805 -0.262474 -0.299315 0.394639 -0.053210 0.268002 -0.255547 -0.220544 -0.142503 -0.029721 -0.108128 0.318662 -0.251677 -0.071759 -0.188951 -0.279968 0.119905 0.096975 0.100967 0.094725 0.100263 0.094140 0.088271 0.095715 0.122826 0.108871 0.098475 0.089582 0.095139 0.094049 0.088344 0.092982 0.102909 0.102556 0.114313 0.120655 0.104673 0.092204 0.103284 0.133501 0.133714 0.109599
qa: -0.2988 -0.4944 -0.4842 0.1078 0.0259 -0.0857 -0.2868 -0.2625 -0.2993 0.3946 -0.0532 0.2680 -0.2555 -0.2205 -0.1425 -0.0297 -0.1081 0.3187 -0.2517 -0.0718 -0.1890 -0.2800 0.1199 0.0970 0.1010 0.0947 0.1003 0.0941 0.0883 0.0957 0.1228 0.1089 0.0985 0.0896 0.0951 0.0940 0.0883 0.0930 0.1029 0.1026 0.1143 0.1207 0.1047 0.0922 0.1033 0.1335 0.1337 0.1096
va: 2.1244 1.9913 2.0122 3.7041 3.7429 3.8679 3.9073 3.9094 3.8499 4.0924 3.7827 3.7373 3.9389 3.9218 3.9124 3.7376 3.4683 4.0269 3.9333 3.8294 3.8378 3.8982 1.0025 1.0298 1.0013 1.0125 1.0009 1.0020 1.0056 1.0013 1.0246 1.0283 0.9963 1.0131 0.9971 0.9965 1.0089 0.9957 1.0285 1.0227 0.9973 1.0041 1.0053 1.0176 1.0009 1.0021 1.0037 1.0203
dispcorr: -0.022901691 hartree
energy: -965.438720696435
dipole: 23.31641 -21.44842 1.86799 -3.29649 3.05904 -0.23745 -7.05621 5.92212 -1.13410
magnitude: 2.19817 au
magnitude: 5.58730 debye
