program: Gaussian 09
title: 000072876
version: EM64L-G09RevD.01
frameworkgroup: C1[X(C7H6BrNO2)]
method: RPBEPBE
basis: SDD
operation: Freq
keyword: #p
keyword: freq=noraman
keyword: PBEPBE/SDD
title: #p freq=noraman PBEPBE/SDD
converged: YES YES NO NO
title: Mulliken charges:
elementType: Br O O N C C C C C C C H H H H H H
charge: 0.007807 -0.397571 -0.356149 -0.626716 0.177538 0.134873 -0.230080 -0.325551 -0.264972 -0.160648 0.235704 0.214021 0.265267 0.255264 0.388238 0.333849 0.349125
chargesum: 0.00000
title: Mulliken charges with hydrogens summed into heavy atoms:
elementType: Br O O N C C C C C C C
charge: 0.007807 -0.009333 -0.356149 0.056258 0.177538 0.134873 -0.016059 -0.060284 -0.264972 0.094616 0.235704
polarizability: 1.59753086e+02 1.59130150e+00 1.18388424e+02 -2.39409970e-02 9.31745482e-03 3.92921444e+01
1716.lowfreq: -11.9088 -8.2265 -0.0005 -0.0004 0.0003 2.4946 55.9926 123.0663 142.7898
frequency: 55.9915 123.0641 142.7897 145.5939 264.8197 301.4383 309.0806 379.4255 398.0244 429.2417 485.0117 494.2927 518.5686 589.2043 609.9242 627.5618 684.5436 733.2971 755.5108 827.4041 836.0404 855.4135 948.3274 963.2257 1040.0816 1071.6983 1094.9166 1145.5739 1241.2486 1266.4784 1324.0367 1384.9379 1399.6775 1426.5985 1461.7414 1550.9928 1573.9034 1620.0472 1647.2254 2753.2619 3147.2729 3162.3837 3183.7745 3538.9147 3690.2330
redmass: 4.7797 6.7481 7.8194 5.7600 15.2913 4.6367 6.7802 6.2229 2.1878 8.1872 1.4682 3.5811 2.5528 1.3246 8.2814 4.7128 4.1104 4.9381 3.8809 1.5287 6.7491 1.6336 1.0685 1.3312 2.1443 2.7398 2.3936 1.4955 1.4155 3.3180 1.8557 3.9933 4.2452 4.5080 2.6472 3.1968 3.7421 1.8691 2.6106 1.0706 1.0914 1.0889 1.0974 1.0456 1.1037
irintensity: 10.4518 0.7250 3.5173 0.1329 0.4912 14.4965 0.7257 8.4694 0.5141 4.6659 74.5948 3.1584 28.8218 182.9250 31.3009 30.4686 16.0083 15.4326 8.7476 65.5672 12.1828 11.6914 147.9082 1.6159 1.6815 17.5730 7.1988 4.7646 45.2976 118.6772 138.3830 56.1074 97.6155 259.9478 181.6789 30.8125 65.5660 243.4666 84.2927 449.8149 7.4535 0.9709 2.9536 74.2376 39.7388
temp: 298.150 k
press: 1.00000 atm
elementType: 35 8 8 7 6 6 6 6 6 6 6 1 1 1 1 1 1
symmnumber: 1
zpe: 312242.0 jmol-1
zpe.correction: 0.118927 hartree
zpe.thermalcorrener: 0.128723 hartree
zpe.thermalcorrenthalpy: 0.129667 hartree
zpe.thermalcorrgfe: 0.082390 hartree
zpe.sumelectzpe: -488.241633 hartree
zpe.sumelectthermal: -488.231837 hartree
zpe.sumelectthermalent: -488.230892 hartree
zpe.sumelectthermalfe: -488.278169 hartree
dipole: -1.0700 -3.2119 0.0081
dipole: 3.3855
quadrupole: -85.6129 -58.3859 -76.6331
quadrupole: -10.7973 0.0135 -0.0102
quadrupole: -12.0690 15.1581 -3.0891 -10.7973 0.0135 -0.0102
hfenergy: -488.3605594 hartree
pointgroup: C01 [X(C7H6Br1N1O2)]
dipole: 0.0242032 1.2719742 0.394471 debye
dipolederiv: -0.4760289 0.2499187 0.0735102 0.3406946 -0.2629387 -0.0675144 0.1022037 -0.0686696 -0.0562171 -1.0582153 0.4694067 0.1389268 0.3528847 -0.7955879 -0.1209073 0.1018949 -0.1190568 -0.4303201 -1.1015946 0.20285 0.0545725 0.0551824 -0.7891394 -0.1223793 0.0095147 -0.1207808 -0.4297016 -0.4661944 -0.3081577 -0.0928253 -0.472569 -1.1293468 -0.1474043 -0.1440989 -0.1454688 -0.7207028 -0.8464451 -0.3497461 -0.1185313 0.0452367 -0.2707488 -0.0725528 0.0041615 -0.0773137 -0.0594669 0.8209811 -0.6697106 -0.2002189 -0.3977957 0.5454975 0.1315161 -0.1150765 0.127331 0.1468691 0.1782506 0.2985966 0.0965457 0.0334941 -0.1125979 -0.0112219 0.014479 -0.0080743 -0.0771361 -0.22199 0.3162053 0.0980398 0.0101308 0.0337173 0.0643759 0.0024172 0.0682932 -0.1502816 0.5485106 -0.7059794 -0.2137729 -0.8262554 0.1752185 0.0944096 -0.2522356 0.0957455 -0.1263565 -0.1178287 0.0992314 0.0309385 0.2429265 0.162087 0.074241 0.0763777 0.07256 -0.0435173 1.6271681 0.2937557 0.1070385 0.4846121 1.4343735 0.3650105 0.1658939 0.3633115 0.3902568 0.0927853 -0.053389 -0.0174024 -0.0404003 -0.055501 -0.0654941 -0.0133497 -0.0657783 0.1309655 0.069486 0.0134585 0.0030126 -0.0169209 -0.0184743 -0.0603254 -0.0066904 -0.0598273 0.1545991 -0.0272525 -0.0536336 -0.0189766 -0.0416246 0.1039572 -0.0171625 -0.0153017 -0.0173299 0.1515273 0.5770585 0.0881671 0.0297441 0.1088605 0.5123914 0.0460654 0.0364604 0.0457313 0.382725 0.1763911 0.0545432 0.0143894 0.0831828 0.2409835 -0.0418276 0.0232367 -0.0419211 0.3664269 0.2249184 0.0544831 0.0150092 0.0383608 0.226109 -0.0488289 0.010113 -0.048752 0.3703302 unknown
polarizability: 154.1469032|-13.950301|116.5298786|-3.0778171|23.9890875|46.7568727 unknown
InChI: InChI=1S/C7H6BrNO2/c8-4-1-2-6(10)5(3-4)7(9)11/h1-3,10H,9H2
charge 0 multiplicity 1
17 atoms
Br -3.372986 1.553286 0.667405
O  1.356143 -2.22916 -0.461894
O  2.954662 -0.374829 0.135119
N  2.266552 1.724973 0.779581
C  0.569886 0.002664 0.225018
C  0.333189 -1.352109 -0.201301
C  -0.545246 0.850312 0.478144
C  -1.000869 -1.814956 -0.362066
C  -1.848458 0.366553 0.311579
C  -2.088723 -0.96602 -0.10891
C  1.98079 0.442955 0.378608
H  -0.407377 1.885759 0.805252
H  -1.152824 -2.847605 -0.687344
H  -3.112655 -1.329426 -0.234927
H  2.242799 -1.716067 -0.290516
H  1.552335 2.418284 0.985119
H  3.248881 1.981988 0.870833
