program: Orca
programVersion: 5.0.2
elementType: O O O C C C C C C C C C C C C C C C C C C C H H H H H H H H H H H H H H H H H H H H H H H H H H
charge: 0
multiplicity: 1
keywords: wb97x-d3
keywords: def2-TZVPP
keywords: def2/J RIJCOSX
keywords: DEFGRID2
keywords: scfconv7
keywords: smallprint printgap noloewdin
keywords: NOSOSCF
formula: C19H26O3
InChI: InChI=1/C19H26O3/c1-7-8-13-12(4)16(10-15(13)20)22-18(21)17-14(9-11(2)3)19(17,5)6/h7,9,14,16-17H,1,8,10H2,2-6H3
48 atoms
O  0.069804 1.620257 1.268862
O  0.24163 0.555406 -0.688424
O  -3.924071 1.38168 -1.204595
C  3.249174 1.320717 -0.608547
C  3.138182 0.051468 0.16085
C  2.212599 1.235031 0.494905
C  2.851797 1.396081 -2.061871
C  4.425654 2.212376 -0.283664
C  2.621338 -1.207636 -0.424457
C  0.771549 1.095195 0.255471
C  2.313175 -2.29971 0.281719
C  -1.352666 1.477022 1.281878
C  2.409958 -2.374445 1.774915
C  1.841857 -3.552994 -0.389362
C  -2.1167 2.215473 0.186236
C  -1.819212 0.045437 1.192727
C  -2.838199 -0.089986 0.329633
C  -3.080968 1.183903 -0.349544
C  -1.18912 -1.008586 2.022204
C  -3.586053 -1.331138 -0.035678
C  -2.932427 -1.989401 -1.215738
C  -3.47888 -2.09315 -2.420597
H  3.892786 -0.084767 0.929485
H  2.459844 1.766055 1.40629
H  2.533984 2.408801 -2.315238
H  3.717212 1.160812 -2.684114
H  2.052142 0.719055 -2.346084
H  4.201125 3.255296 -0.514211
H  4.702394 2.154716 0.769535
H  5.297257 1.92182 -0.873162
H  2.519087 -1.25209 -1.503933
H  -1.624538 1.867211 2.264699
H  3.263932 -2.987738 2.076092
H  1.524403 -2.85532 2.19627
H  2.517396 -1.400029 2.248471
H  0.826398 -3.803714 -0.070806
H  2.46875 -4.406145 -0.117774
H  1.842428 -3.464754 -1.475517
H  -1.477046 2.587394 -0.61517
H  -2.66645 3.073869 0.575048
H  -1.817343 -1.893803 2.104753
H  -0.241318 -1.324757 1.57839
H  -0.963846 -0.644117 3.02524
H  -4.625023 -1.088177 -0.268088
H  -3.598653 -2.021092 0.811272
H  -1.933279 -2.379838 -1.042782
H  -2.954183 -2.568863 -3.239152
H  -4.470773 -1.71094 -2.632338
elementType: O C H
totalener: -965.41255010 hartree
nucrepener: 1898.81583169 hartree
electener: -2864.22838179 hartree
oneelecener: -5084.86400323 hartree
twoeener: 2220.63562144 hartree
cpcmener: -0.04143438 hartree
kineticenergy: 961.00886127 hartree
xcener: -95.146185388685 hartree
chargesum: -0.0000000
charge: -0.307867 -0.494899 -0.490714 0.138529 -0.034961 -0.090246 -0.297786 -0.261879 -0.260012 0.391389 -0.019790 0.305962 -0.291799 -0.234619 -0.154478 0.000073 -0.135241 0.295900 -0.253324 -0.094647 -0.185727 -0.286025 0.113517 0.092239 0.102872 0.100683 0.090787 0.095714 0.088637 0.095354 0.127214 0.119195 0.117598 0.096192 0.097255 0.090923 0.102754 0.091801 0.113333 0.112388 0.114315 0.086346 0.120759 0.091517 0.109952 0.145282 0.131176 0.114359
qa: -0.3079 -0.4949 -0.4907 0.1385 -0.0350 -0.0902 -0.2978 -0.2619 -0.2600 0.3914 -0.0198 0.3060 -0.2918 -0.2346 -0.1545 0.0001 -0.1352 0.2959 -0.2533 -0.0946 -0.1857 -0.2860 0.1135 0.0922 0.1029 0.1007 0.0908 0.0957 0.0886 0.0954 0.1272 0.1192 0.1176 0.0962 0.0973 0.0909 0.1028 0.0918 0.1133 0.1124 0.1143 0.0863 0.1208 0.0915 0.1100 0.1453 0.1312 0.1144
va: 2.1284 1.9944 2.0014 3.7683 3.7939 3.8657 3.8942 3.8931 3.8437 4.0784 3.6885 3.7603 3.9429 3.9257 3.8689 3.6804 3.4744 4.0589 3.9454 3.8619 3.7780 3.9479 1.0025 1.0324 0.9994 0.9989 1.0200 1.0025 1.0046 1.0020 1.0011 0.9917 0.9970 0.9941 1.0025 0.9945 0.9961 1.0072 1.0272 1.0207 1.0038 1.0012 1.0028 1.0222 1.0096 0.9969 1.0031 1.0125
dispcorr: -0.025979019 hartree
energy: -965.438529114674
dipole: 16.22428 -14.07393 2.15035 -12.05405 11.62520 -0.42884 0.85827 1.81771 2.67598
magnitude: 3.45960 au
magnitude: 8.79360 debye
