program: Orca
programVersion: 5.0.2
elementType: O O O C C C C C C C C C C C C C C C C C C C H H H H H H H H H H H H H H H H H H H H H H H H H H
charge: 0
multiplicity: 1
keywords: wb97x-d3
keywords: def2-TZVPP
keywords: def2/J RIJCOSX
keywords: DEFGRID2
keywords: scfconv7
keywords: smallprint printgap noloewdin
keywords: NOSOSCF
formula: C19H26O3
InChI: InChI=1/C19H26O3/c1-7-8-13-12(4)16(10-15(13)20)22-18(21)17-14(9-11(2)3)19(17,5)6/h7,9,14,16-17H,1,8,10H2,2-6H3
48 atoms
O  -0.112598 0.297857 0.397587
O  1.165799 -1.360217 -0.399959
O  -4.533459 0.484598 1.537857
C  3.205953 0.930406 -1.007537
C  3.551069 0.436261 0.351902
C  2.102279 0.808417 0.03241
C  3.26029 0.007447 -2.198788
C  3.586079 2.351242 -1.350107
C  3.982825 -0.960315 0.611194
C  1.049158 -0.214063 -0.029964
C  3.759523 -1.629693 1.744751
C  -1.284634 -0.522598 0.432171
C  2.97143 -1.06721 2.887415
C  4.261704 -3.027062 1.939991
C  -2.176155 -0.08822 1.586799
C  -2.11739 -0.308419 -0.809895
C  -3.372283 0.061377 -0.506849
C  -3.510972 0.1962 0.946239
C  -1.540996 -0.532872 -2.157128
C  -4.508854 0.371956 -1.425793
C  -4.600525 1.852099 -1.657321
C  -5.591687 2.624171 -1.230271
H  4.00977 1.175381 1.004174
H  1.769138 1.749003 0.454019
H  4.251946 0.062909 -2.651806
H  3.069538 -1.035544 -1.962748
H  2.538054 0.317034 -2.956302
H  2.921937 2.761086 -2.113175
H  3.54003 3.006445 -0.479623
H  4.604626 2.388884 -1.741219
H  4.546332 -1.452638 -0.176247
H  -1.002392 -1.573999 0.517784
H  2.735656 -0.011389 2.769329
H  3.511413 -1.187284 3.829292
H  2.028539 -1.608664 3.004059
H  4.922337 -3.089661 2.80824
H  4.808909 -3.392594 1.071354
H  3.433993 -3.714628 2.132707
H  -1.803177 0.819878 2.06513
H  -2.270347 -0.848681 2.362434
H  -0.729477 0.170978 -2.355934
H  -1.115779 -1.53514 -2.23206
H  -2.280788 -0.412749 -2.945787
H  -5.442178 0.002099 -0.99571
H  -4.36967 -0.141812 -2.37936
H  -3.770209 2.295017 -2.199692
H  -5.598264 3.689793 -1.420065
H  -6.43391 2.221204 -0.679845
elementType: O C H
totalener: -965.41499171 hartree
nucrepener: 1822.26383721 hartree
electener: -2787.67882892 hartree
oneelecener: -4931.13587189 hartree
twoeener: 2143.45704297 hartree
cpcmener: -0.03784548 hartree
kineticenergy: 961.00403082 hartree
xcener: -95.142170442078 hartree
chargesum: 0.0000000
charge: -0.301723 -0.494722 -0.485525 0.128567 -0.013245 -0.101898 -0.297894 -0.264021 -0.287528 0.403084 -0.019849 0.261709 -0.268014 -0.224858 -0.141253 -0.035969 -0.075432 0.307498 -0.258116 -0.102408 -0.180508 -0.285158 0.116106 0.094743 0.101916 0.094267 0.099227 0.095822 0.088676 0.094265 0.124780 0.106059 0.095853 0.106222 0.100079 0.096412 0.089900 0.094530 0.102703 0.102775 0.113962 0.117378 0.105096 0.095022 0.110820 0.144333 0.132032 0.114286
qa: -0.3017 -0.4947 -0.4855 0.1286 -0.0132 -0.1019 -0.2979 -0.2640 -0.2875 0.4031 -0.0198 0.2617 -0.2680 -0.2249 -0.1413 -0.0360 -0.0754 0.3075 -0.2581 -0.1024 -0.1805 -0.2852 0.1161 0.0947 0.1019 0.0943 0.0992 0.0958 0.0887 0.0943 0.1248 0.1061 0.0959 0.1062 0.1001 0.0964 0.0899 0.0945 0.1027 0.1028 0.1140 0.1174 0.1051 0.0950 0.1108 0.1443 0.1320 0.1143
va: 2.1158 1.9821 2.0068 3.7404 3.8261 3.8519 3.8976 3.8987 3.8564 4.0557 3.7048 3.7562 3.9456 3.9247 3.9203 3.7726 3.4537 4.0474 3.9401 3.8589 3.7848 3.9472 1.0043 1.0310 0.9987 1.0141 1.0022 1.0020 1.0049 1.0019 0.9998 1.0271 1.0051 0.9998 0.9978 0.9967 1.0068 0.9960 1.0302 1.0228 0.9975 1.0040 1.0066 1.0206 1.0058 1.0002 1.0026 1.0129
dispcorr: -0.023637041 hartree
energy: -965.438628747771
dipole: 16.82497 -15.02636 1.79862 0.04831 0.19614 0.24445 -4.69164 3.80859 -0.88305
magnitude: 2.01855 au
magnitude: 5.13076 debye
