program: Orca
programVersion: 5.0.2
elementType: O O O C C C C C C C C C C C C C C C C C C C H H H H H H H H H H H H H H H H H H H H H H H H H H
charge: 0
multiplicity: 1
keywords: wb97x-d3
keywords: def2-TZVPP
keywords: def2/J RIJCOSX
keywords: DEFGRID2
keywords: scfconv7
keywords: smallprint printgap noloewdin
keywords: NOSOSCF
formula: C19H26O3
InChI: InChI=1/C19H26O3/c1-7-8-13-12(4)16(10-15(13)20)22-18(21)17-14(9-11(2)3)19(17,5)6/h7,9,14,16-17H,1,8,10H2,2-6H3
48 atoms
O  -0.264368 0.536358 0.539521
O  0.749842 -1.232176 -0.384634
O  -4.729666 1.088401 1.587471
C  3.105756 0.779528 -0.786537
C  3.408876 0.121967 0.522104
C  2.016144 0.704439 0.270611
C  3.016374 -0.021831 -2.061216
C  3.674331 2.161391 -1.005729
C  3.66142 -1.322252 0.680126
C  0.812863 -0.12317 0.095588
C  4.592024 -1.869569 1.471525
C  -1.55679 -0.068018 0.437082
C  5.550423 -1.113911 2.340636
C  4.741651 -3.359935 1.547888
C  -2.42148 0.339465 1.620238
C  -2.290674 0.443897 -0.777969
C  -3.502188 0.926541 -0.457544
C  -3.703505 0.824475 0.990331
C  -1.699379 0.320809 -2.131358
C  -4.561597 1.433643 -1.373446
C  -5.476917 0.368557 -1.905119
C  -5.366619 -0.93924 -1.705562
H  3.967058 0.751267 1.205601
H  1.822138 1.636067 0.788406
H  3.988525 -0.011846 -2.55726
H  2.737883 -1.062014 -1.920098
H  2.296086 0.427274 -2.747684
H  4.686488 2.097305 -1.409577
H  3.067786 2.724148 -1.71793
H  3.720819 2.735383 -0.079765
H  3.045904 -2.001918 0.103997
H  -1.45869 -1.153985 0.37704
H  5.487182 -0.032449 2.242869
H  6.578583 -1.404519 2.111601
H  5.390852 -1.361368 3.393078
H  5.742271 -3.671105 1.236591
H  4.016661 -3.881022 0.923005
H  4.615834 -3.71163 2.575329
H  -1.969435 1.161754 2.179928
H  -2.604812 -0.473637 2.322204
H  -0.756387 0.867774 -2.202888
H  -1.474553 -0.724716 -2.35178
H  -2.364605 0.696241 -2.906028
H  -4.113987 1.960982 -2.220791
H  -5.16557 2.185824 -0.857758
H  -6.296008 0.739548 -2.513372
H  -6.0790 -1.627577 -2.141608
H  -4.571884 -1.376962 -1.113248
elementType: O C H
totalener: -965.41582816 hartree
nucrepener: 1792.65149233 hartree
electener: -2758.06732050 hartree
oneelecener: -4871.67803371 hartree
twoeener: 2113.61071321 hartree
cpcmener: -0.03665597 hartree
kineticenergy: 960.99270970 hartree
xcener: -95.143548558425 hartree
chargesum: -0.0000000
charge: -0.298600 -0.494643 -0.485556 0.106578 0.023717 -0.083822 -0.286014 -0.261557 -0.296904 0.396247 -0.055442 0.266931 -0.255801 -0.219453 -0.135415 -0.037609 -0.092103 0.319266 -0.247796 -0.086763 -0.187894 -0.282646 0.120054 0.096752 0.100111 0.094728 0.100860 0.095087 0.093673 0.088386 0.122753 0.104473 0.088877 0.095557 0.098273 0.093615 0.088740 0.093257 0.103254 0.098893 0.118200 0.116695 0.103766 0.104449 0.094259 0.134258 0.133965 0.112344
qa: -0.2986 -0.4946 -0.4856 0.1066 0.0237 -0.0838 -0.2860 -0.2616 -0.2969 0.3962 -0.0554 0.2669 -0.2558 -0.2195 -0.1354 -0.0376 -0.0921 0.3193 -0.2478 -0.0868 -0.1879 -0.2826 0.1201 0.0968 0.1001 0.0947 0.1009 0.0951 0.0937 0.0884 0.1228 0.1045 0.0889 0.0956 0.0983 0.0936 0.0887 0.0933 0.1033 0.0989 0.1182 0.1167 0.1038 0.1044 0.0943 0.1343 0.1340 0.1123
va: 2.1233 1.9905 2.0096 3.7011 3.7469 3.8651 3.9063 3.9096 3.8517 4.0883 3.7852 3.7600 3.9394 3.9209 3.9243 3.7531 3.4515 4.0318 3.9322 3.8414 3.8268 3.9041 1.0022 1.0299 1.0015 1.0125 1.0005 1.0015 1.0019 1.0056 1.0245 1.0327 1.0136 0.9970 0.9963 0.9965 1.0088 0.9958 1.0273 1.0244 0.9989 1.0025 1.0052 1.0001 1.0169 1.0019 1.0036 1.0150
dispcorr: -0.022763419 hartree
energy: -965.438591582483
dipole: 22.36747 -20.21820 2.14927 -3.98493 4.62960 0.64467 -6.30110 5.33519 -0.96591
magnitude: 2.44294 au
magnitude: 6.20945 debye
