program: Orca
programVersion: 5.0.2
elementType: O O O C C C C C C C C C C C C C C C C C C C H H H H H H H H H H H H H H H H H H H H H H H H H H
charge: 0
multiplicity: 1
keywords: wb97x-d3
keywords: def2-TZVPP
keywords: def2/J RIJCOSX
keywords: DEFGRID2
keywords: scfconv7
keywords: smallprint printgap noloewdin
keywords: NOSOSCF
formula: C19H26O3
InChI: InChI=1/C19H26O3/c1-7-8-13-12(4)16(10-15(13)20)22-18(21)17-14(9-11(2)3)19(17,5)6/h7,9,14,16-17H,1,8,10H2,2-6H3
48 atoms
O  -0.372377 0.113275 1.013455
O  0.489154 -1.951266 1.173076
O  -4.747514 1.515924 0.990452
C  3.060868 -0.351212 2.022495
C  3.176251 -0.806086 0.608173
C  1.935996 -0.051857 1.042882
C  3.856791 0.852711 2.467626
C  2.87821 -1.381789 3.109408
C  4.137921 -0.190258 -0.342552
C  0.640969 -0.759701 1.091388
C  3.893089 0.085946 -1.62418
C  -1.713089 -0.379703 1.032322
C  2.578445 -0.182197 -2.291227
C  4.941391 0.693441 -2.506862
C  -2.621832 0.612168 1.747466
C  -2.267449 -0.473611 -0.369205
C  -3.423465 0.191564 -0.495479
C  -3.755252 0.869806 0.770704
C  -1.561826 -1.255931 -1.415176
C  -4.288037 0.317511 -1.710276
C  -3.746048 1.342484 -2.66194
C  -3.402335 1.100338 -3.919225
H  3.004475 -1.871195 0.46922
H  1.868273 0.983573 0.729252
H  4.859875 0.556003 2.780759
H  3.963173 1.598127 1.679699
H  3.376025 1.335764 3.319744
H  2.339732 -2.262634 2.769812
H  3.855233 -1.707968 3.470685
H  2.337611 -0.962431 3.960038
H  5.129639 0.022373 0.047076
H  -1.731535 -1.364719 1.505795
H  2.108914 0.749633 -2.6172
H  1.8754 -0.708506 -1.649471
H  2.722254 -0.786954 -3.189711
H  4.59337 1.635792 -2.937017
H  5.175787 0.035798 -3.347371
H  5.866997 0.891709 -1.968232
H  -2.099362 1.549102 1.950086
H  -3.005207 0.24385 2.699213
H  -0.627099 -0.763989 -1.695131
H  -1.299285 -2.250117 -1.051921
H  -2.156354 -1.353977 -2.320665
H  -5.291136 0.612612 -1.39035
H  -4.385449 -0.645749 -2.216111
H  -3.633819 2.34516 -2.261426
H  -3.015662 1.879968 -4.561003
H  -3.500707 0.115229 -4.359574
totalener: -965.40583055 hartree
nucrepener: 1813.76136010 hartree
electener: -2779.16719065 hartree
oneelecener: -4913.45151707 hartree
twoeener: 2134.28432642 hartree
kineticenergy: 961.04440635 hartree
xcener: -95.138888311803 hartree
chargesum: -0.0000000
charge: -0.269625 -0.390151 -0.329654 0.125336 -0.010229 -0.127604 -0.271781 -0.261350 -0.245184 0.317345 -0.004849 0.224370 -0.209793 -0.212014 -0.135160 -0.071693 -0.043712 0.221025 -0.238269 -0.114328 -0.141145 -0.221205 0.107002 0.088849 0.090832 0.086309 0.092054 0.102657 0.084902 0.085948 0.094167 0.098953 0.095326 0.057798 0.092962 0.085282 0.088281 0.079452 0.089112 0.086583 0.098353 0.124130 0.086425 0.103610 0.089325 0.119021 0.103014 0.079322
qa: -0.2696 -0.3902 -0.3297 0.1253 -0.0102 -0.1276 -0.2718 -0.2613 -0.2452 0.3173 -0.0048 0.2244 -0.2098 -0.2120 -0.1352 -0.0717 -0.0437 0.2210 -0.2383 -0.1143 -0.1411 -0.2212 0.1070 0.0888 0.0908 0.0863 0.0921 0.1027 0.0849 0.0859 0.0942 0.0990 0.0953 0.0578 0.0930 0.0853 0.0883 0.0795 0.0891 0.0866 0.0984 0.1241 0.0864 0.1036 0.0893 0.1190 0.1030 0.0793
va: 2.1187 2.1041 2.1709 3.7326 3.8059 3.8325 3.9094 3.9047 3.9009 4.2239 3.7468 3.7608 3.9333 3.9427 3.8644 3.7491 3.3989 4.1277 3.9338 3.8885 3.8355 3.9572 1.0262 1.0328 1.0015 1.0048 1.0063 1.0202 1.0026 1.0019 1.0101 1.0290 0.9992 1.0195 1.0035 0.9991 0.9985 1.0097 1.0331 1.0286 1.0053 1.0085 1.0138 1.0263 1.0034 1.0098 1.0110 1.0150
dispcorr: -0.023514155 hartree
energy: -965.429344708933
dipole: 20.85643 -19.53116 1.32527 0.07902 -0.23165 -0.15263 -9.44270 8.92698 -0.51571
magnitude: 1.43024 au
magnitude: 3.63538 debye
