program: Orca
programVersion: 5.0.2
elementType: O O O C C C C C C C C C C C C C C C C C C C H H H H H H H H H H H H H H H H H H H H H H H H H H
charge: 0
multiplicity: 1
keywords: wb97x-d3
keywords: def2-TZVPP
keywords: def2/J RIJCOSX
keywords: DEFGRID2
keywords: scfconv7
keywords: smallprint printgap noloewdin
keywords: NOSOSCF
formula: C19H26O3
InChI: InChI=1/C19H26O3/c1-7-8-13-12(4)16(10-15(13)20)22-18(21)17-14(9-11(2)3)19(17,5)6/h7,9,14,16-17H,1,8,10H2,2-6H3
48 atoms
O  -0.559036 0.069923 1.012028
O  0.475346 -1.91863 0.944729
O  -5.094819 0.949135 1.083637
C  2.94724 -0.252975 1.90821
C  3.024942 -0.494342 0.435215
C  1.7566 0.097582 1.034932
C  3.674931 0.922612 2.518255
C  2.902726 -1.448013 2.8295
C  3.86015 0.303709 -0.479419
C  0.525001 -0.716939 0.998305
C  4.293087 -0.066415 -1.687517
C  -1.8501 -0.536273 0.9204
C  3.97448 -1.372113 -2.35164
C  5.164261 0.843246 -2.501538
C  -2.862989 0.24793 1.743306
C  -2.363646 -0.463353 -0.497243
C  -3.579471 0.095588 -0.560909
C  -4.016632 0.502729 0.788517
C  -1.554095 -0.990502 -1.625594
C  -4.42083 0.333408 -1.766749
C  -4.006687 1.519592 -2.591858
C  -2.953035 2.297832 -2.388181
H  2.906684 -1.537753 0.165719
H  1.5971 1.158678 0.880671
H  3.244997 1.168142 3.490502
H  4.728756 0.683913 2.671653
H  3.624397 1.82348 1.907977
H  2.359849 -1.212293 3.746991
H  2.433275 -2.317128 2.376516
H  3.919606 -1.72642 3.112203
H  4.152277 1.28866 -0.128863
H  -1.785664 -1.578773 1.242124
H  3.486132 -1.198115 -3.31404
H  3.320471 -2.0166 -1.768154
H  4.889207 -1.930792 -2.566187
H  4.695539 1.08442 -3.45908
H  6.119252 0.365641 -2.73515
H  5.377142 1.779789 -1.987235
H  -2.448356 1.206743 2.062063
H  -3.199724 -0.273831 2.639092
H  -0.660056 -0.381083 -1.775568
H  -1.211918 -2.006042 -1.421273
H  -2.109629 -0.984697 -2.561159
H  -5.458742 0.472848 -1.450922
H  -4.427118 -0.554043 -2.408716
H  -4.658994 1.734188 -3.432618
H  -2.745911 3.133133 -3.042718
H  -2.267672 2.145763 -1.564329
totalener: -965.40658887 hartree
nucrepener: 1802.32301982 hartree
electener: -2767.72960868 hartree
oneelecener: -4890.61772803 hartree
twoeener: 2122.88811935 hartree
kineticenergy: 961.03757946 hartree
xcener: -95.140708682717 hartree
chargesum: 0.0000000
charge: -0.278701 -0.395212 -0.325620 0.091689 0.012534 -0.071383 -0.269182 -0.254478 -0.185333 0.318758 -0.038915 0.252325 -0.243402 -0.205787 -0.150036 -0.108505 -0.065911 0.239372 -0.230479 -0.086411 -0.156233 -0.204333 0.095716 0.075861 0.091822 0.098925 0.074400 0.084102 0.100386 0.086305 0.074875 0.102338 0.084724 0.084588 0.088383 0.084259 0.085051 0.076597 0.089034 0.087101 0.099235 0.123783 0.095514 0.098296 0.086068 0.102691 0.101397 0.083790
qa: -0.2787 -0.3952 -0.3256 0.0917 0.0125 -0.0714 -0.2692 -0.2545 -0.1853 0.3188 -0.0389 0.2523 -0.2434 -0.2058 -0.1500 -0.1085 -0.0659 0.2394 -0.2305 -0.0864 -0.1562 -0.2043 0.0957 0.0759 0.0918 0.0989 0.0744 0.0841 0.1004 0.0863 0.0749 0.1023 0.0847 0.0846 0.0884 0.0843 0.0851 0.0766 0.0890 0.0871 0.0992 0.1238 0.0955 0.0983 0.0861 0.1027 0.1014 0.0838
va: 2.1230 2.1040 2.1784 3.7674 3.8069 3.8259 3.9190 3.9088 3.9197 4.2551 3.8137 3.7187 3.9445 3.9362 3.8797 3.7397 3.4169 4.0985 3.9397 3.8581 3.8846 3.9298 1.0268 1.0361 1.0044 1.0013 1.0092 1.0027 1.0215 1.0010 1.0210 1.0300 0.9992 1.0161 0.9992 0.9985 0.9978 1.0120 1.0311 1.0292 1.0008 1.0075 1.0046 1.0245 0.9990 1.0092 1.0115 1.0247
dispcorr: -0.022562844 hartree
energy: -965.429151710342
dipole: 24.40807 -23.02183 1.38624 0.63147 -0.71934 -0.08787 -8.69317 8.07863 -0.61454
magnitude: 1.51890 au
magnitude: 3.86073 debye
