program: Orca
programVersion: 5.0.2
elementType: O O O C C C C C C C C C C C C C C C C C C C H H H H H H H H H H H H H H H H H H H H H H H H H H
charge: 0
multiplicity: 1
keywords: wb97x-d3
keywords: def2-TZVPP
keywords: def2/J RIJCOSX
keywords: DEFGRID2
keywords: scfconv7
keywords: smallprint printgap noloewdin
keywords: NOSOSCF
formula: C19H26O3
InChI: InChI=1/C19H26O3/c1-7-8-13-12(4)16(10-15(13)20)22-18(21)17-14(9-11(2)3)19(17,5)6/h7,9,14,16-17H,1,8,10H2,2-6H3
48 atoms
O  -0.23207 -0.070952 0.840606
O  0.65573 -2.049908 0.263894
O  -4.659171 1.213341 1.00906
C  3.077897 -0.92946 1.948661
C  3.363767 -0.8414 0.488524
C  2.065349 -0.27299 1.022079
C  3.788667 0.015993 2.887947
C  2.79711 -2.279397 2.562225
C  4.413255 0.058431 -0.056488
C  0.787663 -0.923109 0.666616
C  4.313821 0.775501 -1.17665
C  -1.557984 -0.500516 0.531198
C  3.0930 0.783621 -2.04547
C  5.441594 1.638896 -1.655359
C  -2.552939 0.107359 1.511322
C  -1.983789 0.012072 -0.824004
C  -3.148552 0.671155 -0.764551
C  -3.620635 0.735206 0.632805
C  -1.160478 -0.277739 -2.026346
C  -3.971483 1.236904 -1.876985
C  -4.949243 0.210308 -2.374764
C  -6.254421 0.245457 -2.148768
H  3.233918 -1.779008 -0.047723
H  2.009433 0.80659 1.10241
H  3.205998 0.15886 3.799312
H  4.760681 -0.387812 3.178738
H  3.956745 0.997254 2.444459
H  2.150852 -2.184218 3.436924
H  2.32432 -2.970188 1.868484
H  3.733596 -2.731062 2.894679
H  5.345621 0.10295 0.499565
H  -1.597038 -1.592888 0.539422
H  3.35667 0.550814 -3.079808
H  2.632264 1.77507 -2.059258
H  2.340628 0.065128 -1.727389
H  5.121915 2.678208 -1.765142
H  5.792381 1.316644 -2.638864
H  6.291328 1.619247 -0.974263
H  -2.081352 0.885553 2.115218
H  -2.9880 -0.61791 2.1990
H  -1.63718 0.062223 -2.94366
H  -0.186554 0.212589 -1.9579
H  -0.964787 -1.347655 -2.114313
H  -3.328668 1.572142 -2.69504
H  -4.510265 2.11387 -1.513841
H  -4.522874 -0.623362 -2.925456
H  -6.912694 -0.532045 -2.511782
H  -6.710022 1.047878 -1.582697
totalener: -965.40486719 hartree
nucrepener: 1800.27266287 hartree
electener: -2765.67753006 hartree
oneelecener: -4886.54933670 hartree
twoeener: 2120.87180665 hartree
kineticenergy: 961.03613178 hartree
xcener: -95.136820805560 hartree
chargesum: 0.0000000
charge: -0.269320 -0.386943 -0.328195 0.122184 -0.011680 -0.119312 -0.271451 -0.259129 -0.243531 0.308713 -0.003177 0.217745 -0.216645 -0.212051 -0.136773 -0.060557 -0.031318 0.218590 -0.243939 -0.128717 -0.150822 -0.193434 0.107302 0.088184 0.092184 0.090942 0.086295 0.086765 0.100928 0.085189 0.093976 0.099915 0.093110 0.094263 0.061615 0.085145 0.088048 0.079892 0.089684 0.086298 0.090564 0.094922 0.119184 0.097427 0.093175 0.104293 0.100129 0.090335
qa: -0.2693 -0.3869 -0.3282 0.1222 -0.0117 -0.1193 -0.2715 -0.2591 -0.2435 0.3087 -0.0032 0.2177 -0.2166 -0.2121 -0.1368 -0.0606 -0.0313 0.2186 -0.2439 -0.1287 -0.1508 -0.1934 0.1073 0.0882 0.0922 0.0909 0.0863 0.0868 0.1009 0.0852 0.0940 0.0999 0.0931 0.0943 0.0616 0.0851 0.0880 0.0799 0.0897 0.0863 0.0906 0.0949 0.1192 0.0974 0.0932 0.1043 0.1001 0.0903
va: 2.1163 2.1088 2.1703 3.7387 3.8048 3.8205 3.9092 3.9057 3.9034 4.2334 3.7408 3.7811 3.9368 3.9437 3.8799 3.7230 3.4110 4.1318 3.9390 3.8885 3.8421 3.9840 1.0262 1.0330 1.0064 1.0016 1.0050 1.0018 1.0199 1.0026 1.0101 1.0303 1.0036 0.9983 1.0180 0.9989 0.9984 1.0097 1.0318 1.0290 1.0078 1.0057 1.0047 1.0027 1.0281 1.0082 1.0072 1.0203
dispcorr: -0.023340261 hartree
energy: -965.428207446580
dipole: 19.42091 -18.00643 1.41449 1.73437 -1.60106 0.13332 -5.61612 5.16568 -0.45044
magnitude: 1.49045 au
magnitude: 3.78842 debye
