program: Orca
programVersion: 5.0.2
elementType: O O O C C C C C C C C C C C C C C C C C C C H H H H H H H H H H H H H H H H H H H H H H H H H H
charge: 0
multiplicity: 1
keywords: wb97x-d3
keywords: def2-TZVPP
keywords: def2/J RIJCOSX
keywords: DEFGRID2
keywords: scfconv7
keywords: smallprint printgap noloewdin
keywords: NOSOSCF
formula: C19H26O3
InChI: InChI=1/C19H26O3/c1-7-8-13-12(4)16(10-15(13)20)22-18(21)17-14(9-11(2)3)19(17,5)6/h7,9,14,16-17H,1,8,10H2,2-6H3
48 atoms
O  -0.295265 0.009289 0.859369
O  0.576046 -1.891015 0.044122
O  -4.707403 1.25999 1.309495
C  2.995823 -0.987444 1.863939
C  3.297533 -0.765374 0.422195
C  2.00261 -0.226681 0.998008
C  3.709641 -0.155406 2.902588
C  2.685601 -2.387272 2.33546
C  4.353627 0.168901 -0.042929
C  0.718407 -0.820157 0.575886
C  4.351679 0.789723 -1.22326
C  -1.63028 -0.401276 0.56186
C  3.250323 0.635768 -2.227107
C  5.469461 1.699366 -1.633421
C  -2.588154 0.115888 1.627138
C  -2.114068 0.217269 -0.727635
C  -3.277271 0.862956 -0.567585
C  -3.689096 0.813819 0.848629
C  -1.349407 0.033899 -1.987371
C  -4.109186 1.538268 -1.604174
C  -4.90431 0.616449 -2.484953
C  -4.895385 -0.708703 -2.464654
H  3.151913 -1.6450 -0.199959
H  1.96377 0.840823 1.181798
H  4.678874 -0.594024 3.148667
H  3.882838 0.86906 2.573462
H  3.125596 -0.110497 3.823078
H  2.025795 -2.370634 3.204904
H  2.215456 -2.997757 1.568954
H  3.609384 -2.884382 2.635025
H  5.196235 0.330352 0.622746
H  -1.663746 -1.491115 0.480156
H  3.644538 0.275212 -3.180576
H  2.778749 1.600173 -2.433809
H  2.473368 -0.055548 -1.906797
H  6.23211 1.786607 -0.860765
H  5.09776 2.703158 -1.854005
H  5.954315 1.34072 -2.544679
H  -2.095074 0.839584 2.279165
H  -2.996942 -0.668172 2.264632
H  -1.881116 0.432149 -2.848587
H  -0.377069 0.528666 -1.927583
H  -1.149264 -1.023504 -2.166768
H  -3.480787 2.171497 -2.239357
H  -4.803044 2.221864 -1.106868
H  -5.544494 1.121625 -3.201479
H  -5.512191 -1.279128 -3.145314
H  -4.285971 -1.275654 -1.77285
totalener: -965.40545613 hartree
nucrepener: 1806.33403006 hartree
electener: -2771.73948619 hartree
oneelecener: -4898.64686854 hartree
twoeener: 2126.90738234 hartree
kineticenergy: 961.04103129 hartree
xcener: -95.140007079443 hartree
chargesum: 0.0000000
charge: -0.271033 -0.390372 -0.325639 0.126688 -0.031558 -0.088670 -0.278723 -0.257170 -0.233989 0.306718 0.002360 0.245422 -0.228101 -0.212167 -0.138570 -0.110993 -0.058651 0.235146 -0.227842 -0.088710 -0.157208 -0.204093 0.105585 0.081909 0.094138 0.083340 0.092148 0.087276 0.100895 0.086504 0.094869 0.096561 0.092464 0.087681 0.068428 0.079146 0.085149 0.087717 0.089425 0.086309 0.096462 0.100533 0.116703 0.087419 0.097175 0.102236 0.102054 0.085026
qa: -0.2710 -0.3904 -0.3256 0.1267 -0.0316 -0.0887 -0.2787 -0.2572 -0.2340 0.3067 0.0024 0.2454 -0.2281 -0.2122 -0.1386 -0.1110 -0.0587 0.2351 -0.2278 -0.0887 -0.1572 -0.2041 0.1056 0.0819 0.0941 0.0833 0.0921 0.0873 0.1009 0.0865 0.0949 0.0966 0.0925 0.0877 0.0684 0.0791 0.0851 0.0877 0.0894 0.0863 0.0965 0.1005 0.1167 0.0874 0.0972 0.1022 0.1021 0.0850
va: 2.1186 2.1026 2.1780 3.7527 3.8311 3.8024 3.9126 3.8986 3.9038 4.2383 3.7243 3.7498 3.9477 3.9424 3.8750 3.7387 3.4182 4.1123 3.9336 3.8577 3.8805 3.9382 1.0259 1.0357 0.9999 1.0045 1.0065 1.0017 1.0197 1.0027 1.0092 1.0335 1.0027 0.9992 1.0191 1.0098 0.9986 0.9983 1.0320 1.0286 1.0071 1.0032 1.0065 0.9981 1.0244 1.0093 1.0111 1.0190
dispcorr: -0.023466141 hartree
energy: -965.428922271154
dipole: 20.56011 -19.17817 1.38194 0.35586 -0.14800 0.20786 -6.60103 6.08846 -0.51258
magnitude: 1.48853 au
magnitude: 3.78353 debye
