program: Orca
programVersion: 5.0.2
elementType: O O O C C C C C C C C C C C C C C C C C C C H H H H H H H H H H H H H H H H H H H H H H H H H H
charge: 0
multiplicity: 1
keywords: wb97x-d3
keywords: def2-TZVPP
keywords: def2/J RIJCOSX
keywords: DEFGRID2
keywords: scfconv7
keywords: smallprint printgap noloewdin
keywords: NOSOSCF
formula: C19H26O3
InChI: InChI=1/C19H26O3/c1-7-8-13-12(4)16(10-15(13)20)22-18(21)17-14(9-11(2)3)19(17,5)6/h7,9,14,16-17H,1,8,10H2,2-6H3
48 atoms
O  -0.564953 -0.277243 0.304144
O  0.567919 0.367947 2.119485
O  -4.63876 1.816421 0.753798
C  2.741489 1.171827 0.004094
C  3.100105 -0.151405 0.602462
C  1.714289 0.050292 0.040119
C  3.267099 1.519312 -1.367774
C  2.607381 2.371071 0.90991
C  4.016222 -1.118502 -0.056596
C  0.553018 0.077021 0.952531
C  5.340986 -0.987685 -0.12964
C  -1.774488 -0.308123 1.060831
C  6.083202 0.182188 0.439277
C  6.193103 -2.02685 -0.791995
C  -2.390389 1.067512 1.293791
C  -2.790316 -1.058809 0.239907
C  -3.91409 -0.353964 0.05909
C  -3.784871 0.969796 0.700743
C  -2.491235 -2.427321 -0.252847
C  -5.144566 -0.755278 -0.678889
C  -5.029633 -0.690518 -2.175708
C  -3.951576 -0.368465 -2.87657
H  3.127444 -0.155401 1.689901
H  1.513766 -0.408846 -0.922147
H  4.261712 1.963492 -1.29501
H  3.347578 0.649041 -2.01717
H  2.614396 2.246289 -1.853785
H  1.895485 3.092153 0.503469
H  2.284685 2.111184 1.914625
H  3.572166 2.876827 0.988885
H  3.560601 -2.006333 -0.485635
H  -1.592296 -0.828946 2.006708
H  6.663867 0.688029 -0.33613
H  6.800161 -0.147219 1.195393
H  5.426733 0.916826 0.901468
H  5.601632 -2.853117 -1.183918
H  6.924763 -2.439189 -0.093227
H  6.761904 -1.597179 -1.620315
H  -1.833233 1.852487 0.778339
H  -2.430766 1.347082 2.346196
H  -3.352944 -2.886528 -0.732446
H  -1.678627 -2.403831 -0.980912
H  -2.162668 -3.072182 0.565141
H  -5.970118 -0.109909 -0.365232
H  -5.443152 -1.770501 -0.396071
H  -5.943325 -0.936748 -2.707844
H  -3.978016 -0.349677 -3.957252
H  -3.011393 -0.104605 -2.409154
totalener: -965.40604532 hartree
nucrepener: 1788.64859929 hartree
electener: -2754.05464461 hartree
oneelecener: -4863.36482507 hartree
twoeener: 2109.31018047 hartree
kineticenergy: 961.05132515 hartree
xcener: -95.140410376369 hartree
chargesum: -0.0000000
charge: -0.285238 -0.384555 -0.324699 0.052540 -0.031666 -0.067786 -0.245183 -0.259492 -0.189780 0.316897 -0.020455 0.240701 -0.246896 -0.209252 -0.160606 -0.085538 -0.063639 0.255012 -0.243228 -0.082332 -0.157347 -0.202891 0.110455 0.081006 0.084169 0.084440 0.098445 0.088527 0.105400 0.081338 0.087122 0.092857 0.089006 0.098746 0.085245 0.079423 0.086868 0.085010 0.084745 0.097602 0.092914 0.107100 0.103476 0.097992 0.085573 0.102776 0.101400 0.083798
qa: -0.2852 -0.3846 -0.3247 0.0525 -0.0317 -0.0678 -0.2452 -0.2595 -0.1898 0.3169 -0.0205 0.2407 -0.2469 -0.2093 -0.1606 -0.0855 -0.0636 0.2550 -0.2432 -0.0823 -0.1573 -0.2029 0.1105 0.0810 0.0842 0.0844 0.0984 0.0885 0.1054 0.0813 0.0871 0.0929 0.0890 0.0987 0.0852 0.0794 0.0869 0.0850 0.0847 0.0976 0.0929 0.1071 0.1035 0.0980 0.0856 0.1028 0.1014 0.0838
va: 2.1186 2.1209 2.1810 3.7544 3.8175 3.8394 3.9040 3.9050 3.8644 4.2396 3.7402 3.7609 3.9354 3.9370 3.8910 3.6958 3.4457 4.0830 3.9574 3.8479 3.8854 3.9293 1.0242 1.0327 1.0023 1.0067 1.0062 1.0032 1.0214 1.0032 1.0133 1.0193 0.9982 1.0043 1.0099 1.0106 0.9985 0.9990 1.0298 1.0278 1.0058 1.0036 1.0022 1.0251 0.9987 1.0091 1.0112 1.0252
dispcorr: -0.023318050 hartree
energy: -965.429363365568
dipole: 24.80445 -23.62859 1.17586 -3.38987 2.20216 -1.18771 -9.34639 8.62898 -0.71741
magnitude: 1.81879 au
magnitude: 4.62299 debye
