program: Orca
programVersion: 5.0.2
elementType: O O O C C C C C C C C C C C C C C C C C C C H H H H H H H H H H H H H H H H H H H H H H H H H H
charge: 0
multiplicity: 1
keywords: wb97x-d3
keywords: def2-TZVPP
keywords: def2/J RIJCOSX
keywords: DEFGRID2
keywords: scfconv7
keywords: smallprint printgap noloewdin
keywords: NOSOSCF
formula: C19H26O3
InChI: InChI=1/C19H26O3/c1-7-8-13-12(4)16(10-15(13)20)22-18(21)17-14(9-11(2)3)19(17,5)6/h7,9,14,16-17H,1,8,10H2,2-6H3
48 atoms
O  -0.578042 0.283612 0.867907
O  0.438372 -1.708772 1.026973
O  -5.019561 1.402063 1.207153
C  2.96821 0.071081 1.5347
C  2.954717 -0.400691 0.113562
C  1.72882 0.27472 0.678238
C  3.741989 1.323972 1.868016
C  2.984798 -0.951406 2.643253
C  3.734671 0.274253 -0.953296
C  0.496363 -0.515791 0.879266
C  4.945088 -0.102219 -1.367292
C  -1.870643 -0.292774 1.065665
C  5.689051 -1.264939 -0.78436
C  5.654872 0.626058 -2.46797
C  -2.770263 0.695173 1.797774
C  -2.561823 -0.544032 -0.253751
C  -3.772619 0.028138 -0.299296
C  -4.014685 0.796807 0.934492
C  -1.917639 -1.368528 -1.307343
C  -4.774336 -0.013666 -1.409845
C  -4.438899 0.975151 -2.486174
C  -4.219968 0.664119 -3.756284
H  2.843264 -1.475851 0.004057
H  1.554181 1.299579 0.367775
H  4.794879 1.087523 2.030868
H  3.697673 2.068222 1.074203
H  3.35709 1.782216 2.780561
H  2.514119 -0.557406 3.546008
H  2.47831 -1.875462 2.377524
H  4.018287 -1.196529 2.895271
H  3.27293 1.133507 -1.431345
H  -1.767584 -1.233531 1.612952
H  5.168806 -1.729245 0.051171
H  6.673609 -0.952216 -0.427937
H  5.864516 -2.034144 -1.540905
H  5.069277 1.461078 -2.850293
H  5.87328 -0.041626 -3.305006
H  6.615089 1.017966 -2.123452
H  -2.299036 1.677106 1.871264
H  -3.025225 0.382969 2.810736
H  -1.566488 -2.318332 -0.902184
H  -2.591019 -1.563598 -2.138976
H  -1.041629 -0.857171 -1.713356
H  -5.758682 0.220298 -0.995016
H  -4.837901 -1.018155 -1.83383
H  -4.374502 2.011814 -2.170573
H  -3.982197 1.419816 -4.492206
H  -4.279893 -0.357108 -4.112857
totalener: -965.40644759 hartree
nucrepener: 1777.93741944 hartree
electener: -2743.34386703 hartree
oneelecener: -4841.88888004 hartree
twoeener: 2098.54501301 hartree
kineticenergy: 961.04789508 hartree
xcener: -95.138805181373 hartree
chargesum: 0.0000000
charge: -0.275321 -0.393201 -0.330231 0.118517 -0.031618 -0.122032 -0.239009 -0.276369 -0.187957 0.334918 -0.029291 0.231380 -0.233603 -0.211970 -0.134376 -0.085262 -0.042375 0.220422 -0.225664 -0.114602 -0.142144 -0.218849 0.105222 0.077507 0.087406 0.079794 0.093478 0.088054 0.104924 0.084301 0.088824 0.095591 0.080132 0.084622 0.093485 0.078992 0.086796 0.084554 0.088820 0.086479 0.121299 0.084057 0.100944 0.103961 0.088429 0.119295 0.102514 0.079157
qa: -0.2753 -0.3932 -0.3302 0.1185 -0.0316 -0.1220 -0.2390 -0.2764 -0.1880 0.3349 -0.0293 0.2314 -0.2336 -0.2120 -0.1344 -0.0853 -0.0424 0.2204 -0.2257 -0.1146 -0.1421 -0.2188 0.1052 0.0775 0.0874 0.0798 0.0935 0.0881 0.1049 0.0843 0.0888 0.0956 0.0801 0.0846 0.0935 0.0790 0.0868 0.0846 0.0888 0.0865 0.1213 0.0841 0.1009 0.1040 0.0884 0.1193 0.1025 0.0792
va: 2.1256 2.1023 2.1700 3.7030 3.8052 3.9296 3.9057 3.9075 3.8632 4.2400 3.7415 3.7484 3.9433 3.9405 3.8662 3.7913 3.3924 4.1280 3.9404 3.8897 3.8365 3.9581 1.0243 1.0390 1.0051 1.0074 1.0052 1.0031 1.0203 1.0021 1.0143 1.0284 1.0114 1.0003 1.0008 1.0110 0.9978 0.9989 1.0334 1.0282 1.0080 1.0113 1.0032 1.0256 1.0030 1.0102 1.0110 1.0150
dispcorr: -0.022528041 hartree
energy: -965.428975633167
dipole: 26.39068 -24.87425 1.51643 -1.64992 1.42409 -0.22583 -7.88009 7.42099 -0.45910
magnitude: 1.60041 au
magnitude: 4.06793 debye
