program: Orca
programVersion: 5.0.2
elementType: O O O C C C C C C C C C C C C C C C C C C C H H H H H H H H H H H H H H H H H H H H H H H H H H
charge: 0
multiplicity: 1
keywords: wb97x-d3
keywords: def2-TZVPP
keywords: def2/J RIJCOSX
keywords: DEFGRID2
keywords: scfconv7
keywords: smallprint printgap noloewdin
keywords: NOSOSCF
formula: C19H26O3
InChI: InChI=1/C19H26O3/c1-7-8-13-12(4)16(10-15(13)20)22-18(21)17-14(9-11(2)3)19(17,5)6/h7,9,14,16-17H,1,8,10H2,2-6H3
48 atoms
O  -0.554809 0.03465 0.237759
O  0.589043 1.878305 0.772917
O  -4.761093 1.677507 -0.829142
C  2.739761 0.686712 -1.15856
C  3.105129 0.333203 0.249668
C  1.713372 0.028681 -0.250392
C  3.266215 -0.179479 -2.277106
C  2.624064 2.142788 -1.53682
C  4.021913 -0.787141 0.579567
C  0.563623 0.769824 0.307041
C  5.340113 -0.670562 0.743435
C  -1.744875 0.61511 0.768076
C  6.076155 0.625481 0.592261
C  6.189271 -1.852188 1.101047
C  -2.421782 1.609287 -0.169342
C  -2.748042 -0.492723 0.954458
C  -3.929024 -0.199709 0.395918
C  -3.850641 1.107908 -0.28592
C  -2.386272 -1.713308 1.719421
C  -5.178899 -1.009841 0.403175
C  -5.204201 -2.136077 -0.590744
C  -4.219332 -2.50436 -1.397723
H  3.146556 1.184234 0.924274
H  1.503887 -1.01048 -0.48099
H  2.63279 -0.092087 -3.161415
H  4.274348 0.132589 -2.556535
H  3.318259 -1.232568 -2.003621
H  1.913852 2.281375 -2.354301
H  2.309383 2.773875 -0.709969
H  3.594186 2.504089 -1.88403
H  3.573153 -1.768494 0.704243
H  -1.517219 1.077087 1.73455
H  6.864459 0.534996 -0.15908
H  6.570719 0.903859 1.526258
H  5.430503 1.449871 0.296126
H  6.705268 -1.692646 2.051042
H  6.965387 -2.019883 0.350157
H  5.603656 -2.766483 1.188539
H  -1.959065 1.599425 -1.158756
H  -2.388277 2.637309 0.189333
H  -3.241562 -2.36806 1.871958
H  -1.620292 -2.283865 1.19163
H  -1.967948 -1.452834 2.694091
H  -6.027045 -0.34913 0.201662
H  -5.358824 -1.421291 1.402137
H  -6.141733 -2.681998 -0.628548
H  -4.343205 -3.331586 -2.082721
H  -3.262356 -1.9986 -1.414705
totalener: -965.40644908 hartree
nucrepener: 1781.93145720 hartree
electener: -2747.33790628 hartree
oneelecener: -4849.92594030 hartree
twoeener: 2102.58803401 hartree
kineticenergy: 961.04912565 hartree
xcener: -95.139687082839 hartree
chargesum: -0.0000000
charge: -0.287206 -0.386204 -0.324112 0.106620 -0.037902 -0.101921 -0.237757 -0.273039 -0.185341 0.329132 -0.029310 0.236896 -0.232432 -0.211936 -0.158433 -0.084127 -0.058948 0.251541 -0.243867 -0.084057 -0.156052 -0.203358 0.107515 0.075884 0.094323 0.086729 0.079975 0.087993 0.106496 0.084020 0.087645 0.093364 0.085100 0.094297 0.080886 0.086925 0.084749 0.078418 0.084414 0.098793 0.093068 0.106547 0.103959 0.098022 0.085145 0.102252 0.101458 0.083839
qa: -0.2872 -0.3862 -0.3241 0.1066 -0.0379 -0.1019 -0.2378 -0.2730 -0.1853 0.3291 -0.0293 0.2369 -0.2324 -0.2119 -0.1584 -0.0841 -0.0589 0.2515 -0.2439 -0.0841 -0.1561 -0.2034 0.1075 0.0759 0.0943 0.0867 0.0800 0.0880 0.1065 0.0840 0.0876 0.0934 0.0851 0.0943 0.0809 0.0869 0.0847 0.0784 0.0844 0.0988 0.0931 0.1065 0.1040 0.0980 0.0851 0.1023 0.1015 0.0838
va: 2.1226 2.1175 2.1804 3.7098 3.8178 3.9214 3.9030 3.9053 3.8565 4.2264 3.7412 3.7645 3.9411 3.9403 3.8866 3.6926 3.4434 4.0865 3.9579 3.8486 3.8858 3.9312 1.0228 1.0356 1.0051 1.0046 1.0075 1.0036 1.0206 1.0017 1.0138 1.0193 1.0004 1.0012 1.0113 0.9979 0.9988 1.0107 1.0286 1.0289 1.0059 1.0038 1.0018 1.0242 0.9986 1.0093 1.0111 1.0242
dispcorr: -0.022843485 hartree
energy: -965.429292570255
dipole: 24.97174 -23.72448 1.24726 -9.11482 7.83648 -1.27834 -2.31875 2.79723 0.47848
magnitude: 1.84898 au
magnitude: 4.69975 debye
