program: Orca
programVersion: 5.0.2
elementType: O O O C C C C C C C C C C C C C C C C C C C H H H H H H H H H H H H H H H H H H H H H H H H H H
charge: 0
multiplicity: 1
keywords: wb97x-d3
keywords: def2-TZVPP
keywords: def2/J RIJCOSX
keywords: DEFGRID2
keywords: scfconv7
keywords: smallprint printgap noloewdin
keywords: NOSOSCF
formula: C19H26O3
InChI: InChI=1/C19H26O3/c1-7-8-13-12(4)16(10-15(13)20)22-18(21)17-14(9-11(2)3)19(17,5)6/h7,9,14,16-17H,1,8,10H2,2-6H3
48 atoms
O  -0.454349 -0.052869 0.286039
O  0.636482 1.850942 0.708427
O  -4.69098 1.481835 -0.910824
C  2.836756 0.567108 -1.110076
C  3.198741 0.367606 0.328973
C  1.826383 -0.039589 -0.148582
C  3.41065 -0.381747 -2.133955
C  2.664235 1.972244 -1.632361
C  4.154972 -0.677393 0.77584
C  0.645371 0.710832 0.325458
C  5.475386 -0.513268 0.861472
C  -1.669171 0.540616 0.740176
C  6.168705 0.761137 0.487181
C  6.369289 -1.610664 1.353302
C  -2.341153 1.448648 -0.283541
C  -2.660974 -0.564426 0.994893
C  -3.844422 -0.314203 0.42079
C  -3.772355 0.945925 -0.347696
C  -2.281852 -1.722667 1.844827
C  -5.102435 -1.118856 0.457486
C  -5.177111 -2.044198 -0.723297
C  -6.018617 -1.901746 -1.736948
H  3.19756 1.281528 0.917438
H  1.657242 -1.103167 -0.279955
H  4.407997 -0.055854 -2.435709
H  3.503797 -1.399347 -1.756924
H  2.784415 -0.408426 -3.027285
H  3.621716 2.339137 -2.007976
H  1.957808 1.998067 -2.464417
H  2.314678 2.668263 -0.874506
H  3.734799 -1.636151 1.066129
H  -1.474424 1.080493 1.673039
H  5.490009 1.510955 0.084938
H  6.941842 0.574536 -0.262117
H  6.675919 1.196563 1.351927
H  5.810976 -2.510524 1.608271
H  6.924097 -1.297495 2.241124
H  7.113574 -1.878238 0.599257
H  -1.883571 1.334958 -1.269161
H  -2.296528 2.506251 -0.027354
H  -1.836452 -1.38789 2.78397
H  -3.133877 -2.357588 2.080188
H  -1.531638 -2.337703 1.345014
H  -5.958515 -0.44146 0.449469
H  -5.157378 -1.694848 1.385015
H  -4.460819 -2.860457 -0.731789
H  -6.019624 -2.58811 -2.572581
H  -6.730198 -1.086661 -1.772746
totalener: -965.40607706 hartree
nucrepener: 1767.88130657 hartree
electener: -2733.28738363 hartree
oneelecener: -4821.88687050 hartree
twoeener: 2088.59948687 hartree
kineticenergy: 961.04971558 hartree
xcener: -95.137567845786 hartree
chargesum: -0.0000000
charge: -0.285885 -0.386426 -0.325665 0.086602 -0.035344 -0.089193 -0.240216 -0.269922 -0.185980 0.327948 -0.029118 0.219019 -0.233423 -0.211699 -0.148920 -0.057164 -0.018827 0.228659 -0.260142 -0.128680 -0.147282 -0.193972 0.108993 0.077201 0.086824 0.081092 0.095338 0.083482 0.088632 0.106475 0.087886 0.090593 0.080664 0.085251 0.096125 0.078548 0.087414 0.084843 0.083955 0.099705 0.099810 0.089411 0.108701 0.093386 0.096950 0.104203 0.099645 0.090501
qa: -0.2859 -0.3864 -0.3257 0.0866 -0.0353 -0.0892 -0.2402 -0.2699 -0.1860 0.3279 -0.0291 0.2190 -0.2334 -0.2117 -0.1489 -0.0572 -0.0188 0.2287 -0.2601 -0.1287 -0.1473 -0.1940 0.1090 0.0772 0.0868 0.0811 0.0953 0.0835 0.0886 0.1065 0.0879 0.0906 0.0807 0.0853 0.0961 0.0785 0.0874 0.0848 0.0840 0.0997 0.0998 0.0894 0.1087 0.0934 0.0970 0.1042 0.0996 0.0905
va: 2.1235 2.1169 2.1731 3.7219 3.8170 3.8949 3.9036 3.9042 3.8516 4.2323 3.7418 3.7964 3.9394 3.9398 3.8827 3.7052 3.4146 4.1169 3.9585 3.8821 3.8429 3.9801 1.0240 1.0343 1.0036 1.0073 1.0054 1.0019 1.0036 1.0204 1.0134 1.0188 1.0113 1.0004 1.0017 1.0107 0.9979 0.9990 1.0288 1.0290 1.0020 1.0079 1.0021 1.0276 1.0039 1.0091 1.0072 1.0192
dispcorr: -0.022386663 hartree
energy: -965.428463720469
dipole: 23.97221 -22.62063 1.35158 -8.05011 6.81931 -1.23080 -2.19187 2.67394 0.48207
magnitude: 1.89051 au
magnitude: 4.80529 debye
