program: Orca
programVersion: 5.0.2
elementType: O O O C C C C C C C C C C C C C C C C C C C H H H H H H H H H H H H H H H H H H H H H H H H H H
charge: 0
multiplicity: 1
keywords: wb97x-d3
keywords: def2-TZVPP
keywords: def2/J RIJCOSX
keywords: DEFGRID2
keywords: scfconv7
keywords: smallprint printgap noloewdin
keywords: NOSOSCF
formula: C19H26O3
InChI: InChI=1/C19H26O3/c1-7-8-13-12(4)16(10-15(13)20)22-18(21)17-14(9-11(2)3)19(17,5)6/h7,9,14,16-17H,1,8,10H2,2-6H3
48 atoms
O  -0.198102 0.414718 0.909128
O  0.137598 -0.495554 2.928926
O  -3.688762 2.415626 -1.143241
C  2.193849 -1.387622 0.121629
C  2.547393 0.071551 0.142204
C  1.900276 -0.55238 1.354956
C  3.298707 -2.406482 0.267334
C  1.086076 -1.854547 -0.791292
C  3.946532 0.547689 0.228987
C  0.53727 -0.221108 1.828762
C  4.613558 1.192534 -0.729897
C  -1.546503 0.776943 1.21685
C  4.043302 1.515875 -2.077312
C  6.024905 1.65201 -0.518616
C  -1.905034 2.055847 0.469928
C  -2.500768 -0.26818 0.687239
C  -3.362187 0.244698 -0.201376
C  -3.083436 1.677398 -0.408866
C  -2.421309 -1.67606 1.153353
C  -4.434039 -0.461692 -0.968002
C  -3.881392 -1.048911 -2.233417
C  -3.860601 -2.343155 -2.519371
H  1.88455 0.69422 -0.448214
H  2.556102 -0.759017 2.194138
H  4.080381 -2.084446 0.95376
H  2.901522 -3.353401 0.636786
H  3.771582 -2.595084 -0.698103
H  1.504571 -2.132289 -1.760528
H  0.594905 -2.742703 -0.38645
H  0.323674 -1.100047 -0.970385
H  4.46449 0.356929 1.164611
H  -1.655058 0.881811 2.299065
H  3.029685 1.147494 -2.219762
H  4.661749 1.082147 -2.866941
H  4.036538 2.595193 -2.248726
H  6.398741 1.391475 0.470777
H  6.105311 2.736106 -0.632504
H  6.6971 1.211619 -1.25939
H  -1.076515 2.412422 -0.144193
H  -2.180962 2.873062 1.137715
H  -1.538184 -2.168724 0.740304
H  -2.331272 -1.727588 2.238512
H  -3.287807 -2.256404 0.842616
H  -5.219861 0.257689 -1.213578
H  -4.892328 -1.245339 -0.361287
H  -3.466377 -0.337398 -2.940309
H  -3.439073 -2.71209 -3.444302
H  -4.262423 -3.085609 -1.840304
totalener: -965.40335765 hartree
nucrepener: 1826.23231856 hartree
electener: -2791.63567622 hartree
oneelecener: -4938.23999593 hartree
twoeener: 2146.60431971 hartree
kineticenergy: 961.04777096 hartree
xcener: -95.139064479492 hartree
chargesum: -0.0000000
charge: -0.273359 -0.363697 -0.329988 0.151311 0.050962 -0.144786 -0.235920 -0.316598 -0.223599 0.332661 -0.025245 0.190492 -0.240898 -0.210652 -0.136854 -0.087028 -0.035835 0.219912 -0.228462 -0.115589 -0.144573 -0.218554 0.088932 0.078679 0.075288 0.093160 0.088024 0.095114 0.092947 0.092650 0.081947 0.104183 0.080075 0.086011 0.090290 0.078724 0.086039 0.084572 0.089258 0.089751 0.103367 0.124451 0.085508 0.104278 0.089546 0.122803 0.102862 0.077840
qa: -0.2734 -0.3637 -0.3300 0.1513 0.0510 -0.1448 -0.2359 -0.3166 -0.2236 0.3327 -0.0252 0.1905 -0.2409 -0.2107 -0.1369 -0.0870 -0.0358 0.2199 -0.2285 -0.1156 -0.1446 -0.2186 0.0889 0.0787 0.0753 0.0932 0.0880 0.0951 0.0929 0.0927 0.0819 0.1042 0.0801 0.0860 0.0903 0.0787 0.0860 0.0846 0.0893 0.0898 0.1034 0.1245 0.0855 0.1043 0.0895 0.1228 0.1029 0.0778
va: 2.0827 2.1373 2.1684 3.6501 3.7331 3.9499 3.9110 3.9168 3.9040 4.2687 3.7699 3.7719 3.9517 3.9406 3.8713 3.7446 3.3786 4.1324 3.9422 3.8970 3.8315 3.9626 1.0212 1.0374 1.0103 1.0040 1.0058 1.0079 0.9977 1.0154 1.0180 1.0269 1.0117 1.0003 0.9992 1.0116 0.9980 0.9986 1.0319 1.0269 1.0000 1.0106 1.0104 1.0236 1.0043 1.0100 1.0103 1.0154
dispcorr: -0.023992416 hartree
energy: -965.427350067660
dipole: 18.53325 -17.59530 0.93795 -9.70415 8.96343 -0.74073 -9.77029 9.56303 -0.20726
magnitude: 1.21301 au
magnitude: 3.08322 debye
