program: Orca
programVersion: 5.0.2
elementType: O O O C C C C C C C C C C C C C C C C C C C H H H H H H H H H H H H H H H H H H H H H H H H H H
charge: 0
multiplicity: 1
keywords: wb97x-d3
keywords: def2-TZVPP
keywords: def2/J RIJCOSX
keywords: DEFGRID2
keywords: scfconv7
keywords: smallprint printgap noloewdin
keywords: NOSOSCF
formula: C19H26O3
InChI: InChI=1/C19H26O3/c1-7-8-13-12(4)16(10-15(13)20)22-18(21)17-14(9-11(2)3)19(17,5)6/h7,9,14,16-17H,1,8,10H2,2-6H3
48 atoms
O  -0.113377 0.282454 0.729441
O  0.06924 -0.945048 2.594207
O  -3.658062 2.488007 -1.137218
C  2.511644 -1.219791 0.001506
C  2.714217 0.247018 0.249688
C  2.00572 -0.585752 1.285537
C  3.694519 -2.144967 0.151629
C  1.551994 -1.657369 -1.078088
C  4.051944 0.816648 0.554833
C  0.568444 -0.448758 1.620119
C  4.904204 1.281365 -0.359758
C  -1.506813 0.519717 0.939212
C  4.616175 1.267494 -1.830291
C  6.229183 1.863963 0.027358
C  -1.874157 1.897621 0.403369
C  -2.350019 -0.447634 0.141969
C  -3.193299 0.186745 -0.684239
C  -3.012856 1.645642 -0.567238
C  -2.226805 -1.913557 0.347922
C  -4.231799 -0.408691 -1.583481
C  -5.460038 -0.801184 -0.817543
C  -5.973342 -2.023273 -0.787752
H  2.063333 0.892882 -0.331396
H  2.581202 -0.85399 2.16561
H  3.364211 -3.160231 0.37774
H  4.272564 -2.178902 -0.773992
H  4.372792 -1.82979 0.943181
H  1.110181 -2.627099 -0.837757
H  0.744535 -0.948644 -1.246643
H  2.087958 -1.773211 -2.0222
H  4.341066 0.862725 1.600937
H  -1.733153 0.419162 2.003893
H  4.563698 2.284598 -2.227009
H  3.683345 0.76373 -2.076303
H  5.418365 0.764466 -2.375397
H  6.318465 2.899072 -0.311959
H  7.050666 1.312888 -0.437559
H  6.38409 1.851173 1.105451
H  -1.036825 2.356212 -0.125953
H  -2.180397 2.595574 1.183139
H  -1.260683 -2.279322 -0.00692
H  -2.279807 -2.159519 1.409458
H  -3.008548 -2.463752 -0.170866
H  -3.831062 -1.273594 -2.116432
H  -4.499228 0.335186 -2.338708
H  -5.939155 -0.005903 -0.254951
H  -6.863097 -2.250594 -0.217006
H  -5.527898 -2.843643 -1.338191
totalener: -965.40281389 hartree
nucrepener: 1808.39195623 hartree
electener: -2773.79477012 hartree
oneelecener: -4902.55887142 hartree
twoeener: 2128.76410130 hartree
kineticenergy: 961.04217480 hartree
xcener: -95.137928313444 hartree
chargesum: -0.0000000
charge: -0.272803 -0.361708 -0.330074 0.131372 0.008510 -0.126943 -0.244378 -0.327143 -0.220406 0.333320 -0.021286 0.181320 -0.236861 -0.210841 -0.135875 -0.082980 -0.045606 0.231037 -0.216718 -0.114452 -0.143872 -0.219821 0.101669 0.083795 0.096423 0.085736 0.082698 0.098933 0.095319 0.094258 0.092527 0.104210 0.097026 0.078315 0.085364 0.086637 0.084685 0.079946 0.089575 0.087316 0.099843 0.117685 0.086185 0.091217 0.102321 0.120251 0.103641 0.080631
qa: -0.2728 -0.3617 -0.3301 0.1314 0.0085 -0.1269 -0.2444 -0.3271 -0.2204 0.3333 -0.0213 0.1813 -0.2369 -0.2108 -0.1359 -0.0830 -0.0456 0.2310 -0.2167 -0.1145 -0.1439 -0.2198 0.1017 0.0838 0.0964 0.0857 0.0827 0.0989 0.0953 0.0943 0.0925 0.1042 0.0970 0.0783 0.0854 0.0866 0.0847 0.0799 0.0896 0.0873 0.0998 0.1177 0.0862 0.0912 0.1023 0.1203 0.1036 0.0806
va: 2.0843 2.1387 2.1702 3.6440 3.7763 3.9310 3.9104 3.9117 3.8649 4.2750 3.7386 3.7791 3.9437 3.9418 3.8843 3.7334 3.3837 4.1237 3.9421 3.8921 3.8344 3.9578 1.0165 1.0329 1.0043 1.0036 1.0079 0.9972 1.0124 1.0083 1.0147 1.0284 1.0008 1.0105 1.0009 0.9979 0.9989 1.0106 1.0301 1.0287 1.0026 1.0099 1.0147 1.0026 1.0267 1.0106 1.0113 1.0145
dispcorr: -0.024112494 hartree
energy: -965.426926387134
dipole: 19.10439 -17.93348 1.17092 -8.44138 7.73873 -0.70265 -8.08098 7.73993 -0.34105
magnitude: 1.40751 au
magnitude: 3.57760 debye
