program: Orca
programVersion: 5.0.2
elementType: O O O C C C C C C C C C C C C C C C C C C C H H H H H H H H H H H H H H H H H H H H H H H H H H
charge: 0
multiplicity: 1
keywords: wb97x-d3
keywords: def2-TZVPP
keywords: def2/J RIJCOSX
keywords: DEFGRID2
keywords: scfconv7
keywords: smallprint printgap noloewdin
keywords: NOSOSCF
formula: C19H26O3
InChI: InChI=1/C19H26O3/c1-7-8-13-12(4)16(10-15(13)20)22-18(21)17-14(9-11(2)3)19(17,5)6/h7,9,14,16-17H,1,8,10H2,2-6H3
48 atoms
O  -0.124268 0.299625 0.754029
O  0.073249 -0.945263 2.605689
O  -3.631034 2.457195 -1.181658
C  2.496024 -1.205656 -0.000182
C  2.697041 0.262148 0.242578
C  1.99966 -0.569045 1.286569
C  3.681255 -2.128832 0.142493
C  1.526896 -1.64755 -1.069718
C  4.034158 0.838781 0.537837
C  0.564489 -0.439229 1.632361
C  4.89298 1.274468 -0.384681
C  -1.520571 0.518699 0.967198
C  4.615944 1.213112 -1.856049
C  6.214048 1.871355 -0.006056
C  -1.903865 1.892825 0.432364
C  -2.345852 -0.459015 0.163222
C  -3.167261 0.163712 -0.693041
C  -3.000998 1.624671 -0.581195
C  -2.226653 -1.922082 0.390304
C  -4.171868 -0.444326 -1.621334
C  -5.433002 -0.815178 -0.899507
C  -5.954931 -2.033545 -0.869599
H  2.039788 0.904429 -0.335567
H  2.583946 -0.833836 2.161854
H  4.256796 -2.157931 -0.784909
H  4.360785 -1.81572 0.93376
H  3.353283 -3.145691 0.365055
H  0.719553 -0.938119 -1.236441
H  2.055095 -1.770495 -2.017271
H  1.084877 -2.614927 -0.820464
H  4.315174 0.919622 1.583968
H  -1.744311 0.412742 2.03175
H  4.567624 2.21688 -2.285929
H  3.684222 0.702571 -2.092021
H  5.421766 0.692147 -2.378739
H  7.040025 1.308384 -0.447849
H  6.360821 1.892159 1.073014
H  6.303207 2.895764 -0.37625
H  -1.060664 2.384393 -0.055937
H  -2.260931 2.569157 1.209778
H  -1.244488 -2.289937 0.086031
H  -2.327815 -2.155495 1.451093
H  -2.982084 -2.481043 -0.157097
H  -3.754478 -1.321805 -2.119831
H  -4.403703 0.285318 -2.401893
H  -5.930328 -0.006978 -0.372461
H  -6.869729 -2.245235 -0.333526
H  -5.492595 -2.866128 -1.386654
totalener: -965.40278296 hartree
nucrepener: 1809.99497485 hartree
electener: -2775.39775781 hartree
oneelecener: -4905.77158463 hartree
twoeener: 2130.37382682 hartree
kineticenergy: 961.04514458 hartree
xcener: -95.138259633181 hartree
chargesum: 0.0000000
charge: -0.271600 -0.361218 -0.330078 0.124720 0.008501 -0.120694 -0.244915 -0.326291 -0.219617 0.328679 -0.022074 0.182252 -0.236861 -0.210694 -0.137445 -0.087735 -0.042463 0.231279 -0.213057 -0.114481 -0.143911 -0.219156 0.102448 0.084123 0.085711 0.083034 0.096417 0.095999 0.094094 0.098972 0.092364 0.103972 0.097405 0.078639 0.085553 0.084761 0.079949 0.086609 0.089958 0.088121 0.099940 0.117279 0.085138 0.090027 0.102441 0.120309 0.103580 0.080015
qa: -0.2716 -0.3612 -0.3301 0.1247 0.0085 -0.1207 -0.2449 -0.3263 -0.2196 0.3287 -0.0221 0.1823 -0.2369 -0.2107 -0.1374 -0.0877 -0.0425 0.2313 -0.2131 -0.1145 -0.1439 -0.2192 0.1024 0.0841 0.0857 0.0830 0.0964 0.0960 0.0941 0.0990 0.0924 0.1040 0.0974 0.0786 0.0856 0.0848 0.0799 0.0866 0.0900 0.0881 0.0999 0.1173 0.0851 0.0900 0.1024 0.1203 0.1036 0.0800
va: 2.0847 2.1387 2.1701 3.6488 3.7778 3.9207 3.9104 3.9117 3.8625 4.2797 3.7394 3.7776 3.9428 3.9416 3.8810 3.7384 3.3822 4.1237 3.9450 3.8945 3.8353 3.9586 1.0169 1.0326 1.0032 1.0079 1.0044 1.0122 1.0083 0.9973 1.0146 1.0282 1.0011 1.0104 1.0008 0.9990 1.0107 0.9979 1.0306 1.0280 1.0027 1.0090 1.0139 1.0026 1.0263 1.0107 1.0113 1.0147
dispcorr: -0.024191035 hartree
energy: -965.426973994129
dipole: 18.99596 -17.85215 1.14381 -8.47396 7.78390 -0.69006 -8.12065 7.80658 -0.31407
magnitude: 1.37227 au
magnitude: 3.48803 debye
