program: Orca
programVersion: 5.0.2
elementType: O O O C C C C C C C C C C C C C C C C C C C H H H H H H H H H H H H H H H H H H H H H H H H H H
charge: 0
multiplicity: 1
keywords: wb97x-d3
keywords: def2-TZVPP
keywords: def2/J RIJCOSX
keywords: DEFGRID2
keywords: scfconv7
keywords: smallprint printgap noloewdin
keywords: NOSOSCF
formula: C19H26O3
InChI: InChI=1/C19H26O3/c1-7-8-13-12(4)16(10-15(13)20)22-18(21)17-14(9-11(2)3)19(17,5)6/h7,9,14,16-17H,1,8,10H2,2-6H3
48 atoms
O  -0.038761 0.436365 0.483595
O  0.476679 -0.147356 2.584925
O  -3.757619 2.374327 -1.323448
C  2.186536 -1.608925 -0.219402
C  2.600033 -0.199674 -0.486115
C  2.055966 -0.565109 0.878695
C  3.251338 -2.654024 0.016247
C  0.967315 -2.158953 -0.919797
C  4.027637 0.185053 -0.63987
C  0.765959 -0.086032 1.4194
C  4.567464 1.328285 -0.215131
C  -1.321677 0.934048 0.870276
C  3.790569 2.390641 0.500223
C  6.018428 1.634298 -0.43141
C  -1.71395 2.090764 -0.039727
C  -2.392073 -0.111097 0.657995
C  -3.36957 0.33067 -0.14517
C  -3.062045 1.694097 -0.613795
C  -2.307687 -1.437674 1.320409
C  -4.598922 -0.398937 -0.586833
C  -4.293437 -1.347143 -1.708184
C  -4.480558 -2.658751 -1.66186
H  1.907338 0.357603 -1.111042
H  2.792481 -0.660658 1.668303
H  4.117063 -2.254763 0.544045
H  2.852975 -3.477796 0.610376
H  3.601754 -3.069506 -0.930847
H  0.475255 -2.920964 -0.311752
H  0.233019 -1.395747 -1.166265
H  1.26679 -2.635912 -1.854932
H  4.665093 -0.519016 -1.16725
H  -1.290891 1.229904 1.922063
H  4.193709 2.559059 1.502106
H  2.734099 2.152387 0.600358
H  3.868663 3.344232 -0.02764
H  6.527122 1.809311 0.519845
H  6.144842 2.544206 -1.022997
H  6.536431 0.825411 -0.94485
H  -0.994244 2.223908 -0.849475
H  -1.787238 3.044302 0.484183
H  -1.51195 -2.039817 0.876518
H  -2.069865 -1.333792 2.378856
H  -3.232347 -2.001075 1.217565
H  -5.336659 0.335552 -0.921007
H  -5.045461 -0.941684 0.249333
H  -3.884356 -0.897595 -2.60759
H  -4.239965 -3.295776 -2.501663
H  -4.890299 -3.146745 -0.785421
totalener: -965.40264037 hartree
nucrepener: 1833.20108833 hartree
electener: -2798.60372870 hartree
oneelecener: -4952.20501554 hartree
twoeener: 2153.60128684 hartree
kineticenergy: 961.04806434 hartree
xcener: -95.139295363048 hartree
chargesum: -0.0000000
charge: -0.273561 -0.362002 -0.328963 0.147214 0.015387 -0.127264 -0.279520 -0.301532 -0.264841 0.326296 -0.001536 0.188264 -0.221516 -0.211241 -0.133798 -0.084069 -0.040824 0.220672 -0.227001 -0.111857 -0.143129 -0.220155 0.102416 0.092582 0.087305 0.094713 0.089357 0.093552 0.092015 0.094401 0.093576 0.103890 0.090952 0.073575 0.090770 0.086033 0.087567 0.078574 0.087890 0.088125 0.103912 0.125373 0.084022 0.103552 0.089494 0.119097 0.103257 0.078976
qa: -0.2736 -0.3620 -0.3290 0.1472 0.0154 -0.1273 -0.2795 -0.3015 -0.2648 0.3263 -0.0015 0.1883 -0.2215 -0.2112 -0.1338 -0.0841 -0.0408 0.2207 -0.2270 -0.1119 -0.1431 -0.2202 0.1024 0.0926 0.0873 0.0947 0.0894 0.0936 0.0920 0.0944 0.0936 0.1039 0.0910 0.0736 0.0908 0.0860 0.0876 0.0786 0.0879 0.0881 0.1039 0.1254 0.0840 0.1036 0.0895 0.1191 0.1033 0.0790
va: 2.0670 2.1364 2.1719 3.6770 3.7813 3.8532 3.9161 3.9033 3.9054 4.2174 3.7358 3.7748 3.9414 3.9426 3.8665 3.7433 3.3824 4.1359 3.9416 3.8905 3.8342 3.9584 1.0197 1.0284 1.0052 1.0052 1.0011 0.9973 1.0151 1.0085 1.0100 1.0277 1.0016 1.0199 1.0017 0.9991 0.9989 1.0099 1.0313 1.0278 1.0007 1.0110 1.0117 1.0262 1.0035 1.0097 1.0110 1.0151
dispcorr: -0.024529823 hartree
energy: -965.427170192385
dipole: 16.73749 -15.76614 0.97135 -9.55160 8.82157 -0.73002 -3.39440 3.40978 0.01537
magnitude: 1.21519 au
magnitude: 3.08876 debye
