program: Orca
programVersion: 5.0.2
elementType: O O O C C C C C C C C C C C C C C C C C C C H H H H H H H H H H H H H H H H H H H H H H H H H H
charge: 0
multiplicity: 1
keywords: wb97x-d3
keywords: def2-TZVPP
keywords: def2/J RIJCOSX
keywords: DEFGRID2
keywords: scfconv7
keywords: smallprint printgap noloewdin
keywords: NOSOSCF
formula: C19H26O3
InChI: InChI=1/C19H26O3/c1-7-8-13-12(4)16(10-15(13)20)22-18(21)17-14(9-11(2)3)19(17,5)6/h7,9,14,16-17H,1,8,10H2,2-6H3
48 atoms
O  -0.080301 0.412585 0.531587
O  0.427847 -0.083723 2.65682
O  -3.808671 2.30627 -1.326453
C  2.127144 -1.682858 -0.08668
C  2.54617 -0.288247 -0.410159
C  2.00087 -0.59773 0.970333
C  3.182846 -2.727244 0.190008
C  0.906423 -2.250934 -0.769683
C  3.969313 0.102123 -0.57837
C  0.717843 -0.078495 1.489926
C  4.44882 1.329399 -0.372241
C  -1.361274 0.933756 0.89405
C  3.599672 2.47433 0.089135
C  5.894561 1.651641 -0.597857
C  -1.747032 2.048784 -0.06847
C  -2.433335 -0.116902 0.724028
C  -3.40414 0.288056 -0.105932
C  -3.10265 1.639075 -0.615966
C  -2.357971 -1.413308 1.445202
C  -4.628825 -0.454378 -0.516485
C  -4.399185 -1.526679 -1.544476
C  -3.235588 -1.896132 -2.060845
H  1.851039 0.245241 -1.052232
H  2.737342 -0.666131 1.76264
H  3.542716 -3.169865 -0.741152
H  4.044095 -2.321253 0.719907
H  2.771932 -3.532501 0.80079
H  0.409239 -2.990124 -0.137972
H  0.177942 -1.490095 -1.040584
H  1.204073 -2.757665 -1.689455
H  4.653679 -0.66754 -0.92278
H  -1.330766 1.277138 1.931156
H  3.994154 2.901063 1.014442
H  2.563786 2.19337 0.267432
H  3.605092 3.28032 -0.649192
H  6.009517 2.434938 -1.351078
H  6.46146 0.782687 -0.929611
H  6.359778 2.028733 0.316154
H  -1.033511 2.128576 -0.890938
H  -1.802068 3.02916 0.405307
H  -3.270822 -1.993629 1.327467
H  -1.536326 -2.023294 1.063612
H  -2.16534 -1.259986 2.507508
H  -5.357304 0.258215 -0.913808
H  -5.109104 -0.906414 0.357871
H  -5.301094 -2.030238 -1.878172
H  -3.180499 -2.683415 -2.799796
H  -2.299558 -1.432785 -1.776186
totalener: -965.40224148 hartree
nucrepener: 1850.11600274 hartree
electener: -2815.51824423 hartree
oneelecener: -4986.01757891 hartree
twoeener: 2170.49933468 hartree
kineticenergy: 961.04737079 hartree
xcener: -95.141528909520 hartree
chargesum: 0.0000000
charge: -0.275095 -0.360762 -0.324884 0.155076 0.000433 -0.100990 -0.284861 -0.293264 -0.257006 0.315287 0.001461 0.216939 -0.223894 -0.211931 -0.146339 -0.126658 -0.052323 0.237106 -0.224187 -0.084886 -0.155612 -0.196756 0.100854 0.088201 0.091708 0.084688 0.095087 0.097080 0.075344 0.096733 0.094471 0.104754 0.088121 0.069206 0.091776 0.086775 0.078800 0.086195 0.087549 0.088400 0.095152 0.099063 0.127663 0.098155 0.086946 0.104369 0.101562 0.074493
qa: -0.2751 -0.3608 -0.3249 0.1551 0.0004 -0.1010 -0.2849 -0.2933 -0.2570 0.3153 0.0015 0.2169 -0.2239 -0.2119 -0.1463 -0.1267 -0.0523 0.2371 -0.2242 -0.0849 -0.1556 -0.1968 0.1009 0.0882 0.0917 0.0847 0.0951 0.0971 0.0753 0.0967 0.0945 0.1048 0.0881 0.0692 0.0918 0.0868 0.0788 0.0862 0.0875 0.0884 0.0952 0.0991 0.1277 0.0982 0.0869 0.1044 0.1016 0.0745
va: 2.0693 2.1380 2.1804 3.6951 3.7946 3.8349 3.9207 3.8990 3.9024 4.2378 3.7378 3.7375 3.9465 3.9428 3.8814 3.7366 3.3849 4.1147 3.9442 3.8549 3.9004 3.9257 1.0189 1.0307 1.0000 1.0050 1.0051 0.9964 1.0131 1.0093 1.0099 1.0277 1.0019 1.0212 1.0006 0.9983 1.0099 0.9990 1.0299 1.0281 1.0046 1.0001 1.0089 1.0244 0.9991 1.0077 1.0113 1.0259
dispcorr: -0.025410211 hartree
energy: -965.427651696209
dipole: 17.20049 -16.35069 0.84980 -8.90120 8.11071 -0.79049 -4.19457 4.23274 0.03817
magnitude: 1.16125 au
magnitude: 2.95166 debye
