program: Orca
programVersion: 5.0.2
elementType: O O O C C C C C C C C C C C C C C C C C C C H H H H H H H H H H H H H H H H H H H H H H H H H H
charge: 0
multiplicity: 1
keywords: wb97x-d3
keywords: def2-TZVPP
keywords: def2/J RIJCOSX
keywords: DEFGRID2
keywords: scfconv7
keywords: smallprint printgap noloewdin
keywords: NOSOSCF
formula: C19H26O3
InChI: InChI=1/C19H26O3/c1-7-8-13-12(4)16(10-15(13)20)22-18(21)17-14(9-11(2)3)19(17,5)6/h7,9,14,16-17H,1,8,10H2,2-6H3
48 atoms
O  -0.113093 0.265322 0.594748
O  0.036949 -0.776326 2.572882
O  -3.683401 2.299022 -1.455485
C  2.497739 -1.264233 -0.024433
C  2.740383 0.197894 0.212126
C  1.980926 -0.601243 1.240845
C  3.647219 -2.224041 0.167252
C  1.559478 -1.684019 -1.130014
C  4.081975 0.734639 0.552976
C  0.548667 -0.394476 1.55416
C  4.942039 1.252688 -0.324742
C  -1.503313 0.540122 0.77223
C  4.666384 1.336624 -1.795317
C  6.264906 1.805846 0.110989
C  -1.860715 1.854413 0.089962
C  -2.359701 -0.499532 0.088336
C  -3.230777 0.054005 -0.766485
C  -3.035529 1.515602 -0.811135
C  -2.227238 -1.940837 0.423628
C  -4.28926 -0.620153 -1.570383
C  -5.534433 -0.970579 -0.80579
C  -5.74657 -0.795039 0.490596
H  2.1229 0.855242 -0.391792
H  2.531248 -0.871903 2.135946
H  4.252634 -2.279381 -0.739414
H  4.309115 -1.927079 0.979418
H  3.278674 -3.227774 0.385682
H  2.124271 -1.827195 -2.053267
H  1.079695 -2.636909 -0.895615
H  0.780473 -0.953839 -1.333415
H  4.368005 0.710297 1.600579
H  -1.731205 0.55976 1.84132
H  5.47208 0.867522 -2.36494
H  4.621576 2.378093 -2.124463
H  3.734702 0.853538 -2.083295
H  6.410911 1.720201 1.186986
H  6.355886 2.861677 -0.156082
H  7.090176 1.287816 -0.383696
H  -1.032058 2.224441 -0.516861
H  -2.124666 2.647417 0.789927
H  -2.282247 -2.0940 1.502196
H  -3.003303 -2.539767 -0.048174
H  -1.257288 -2.329584 0.104926
H  -3.893521 -1.530782 -2.031787
H  -4.568685 0.031927 -2.402687
H  -6.323555 -1.409106 -1.408621
H  -6.685572 -1.08113 0.943524
H  -5.005858 -0.357981 1.147562
totalener: -965.40249456 hartree
nucrepener: 1816.19466012 hartree
electener: -2781.59715468 hartree
oneelecener: -4918.19980929 hartree
twoeener: 2136.60265462 hartree
kineticenergy: 961.04107895 hartree
xcener: -95.139819791600 hartree
chargesum: 0.0000000
charge: -0.273933 -0.363688 -0.324653 0.147367 0.009700 -0.138758 -0.240688 -0.324697 -0.221871 0.333829 -0.019788 0.204800 -0.237902 -0.211207 -0.133943 -0.108112 -0.058873 0.234109 -0.223851 -0.089521 -0.156541 -0.203241 0.100767 0.082156 0.085832 0.081696 0.094965 0.094543 0.094712 0.096283 0.091147 0.102614 0.085413 0.095306 0.078600 0.079654 0.086828 0.084433 0.087780 0.087686 0.118648 0.095744 0.103253 0.087094 0.096691 0.102217 0.102671 0.084728
qa: -0.2739 -0.3637 -0.3247 0.1474 0.0097 -0.1388 -0.2407 -0.3247 -0.2219 0.3338 -0.0198 0.2048 -0.2379 -0.2112 -0.1339 -0.1081 -0.0589 0.2341 -0.2239 -0.0895 -0.1565 -0.2032 0.1008 0.0822 0.0858 0.0817 0.0950 0.0945 0.0947 0.0963 0.0911 0.1026 0.0854 0.0953 0.0786 0.0797 0.0868 0.0844 0.0878 0.0877 0.1186 0.0957 0.1033 0.0871 0.0967 0.1022 0.1027 0.0847
va: 2.0832 2.1376 2.1790 3.6320 3.7705 3.9468 3.9104 3.9118 3.8756 4.2733 3.7367 3.7646 3.9467 3.9419 3.8811 3.7224 3.4000 4.1128 3.9436 3.8634 3.8806 3.9383 1.0155 1.0347 1.0046 1.0082 1.0042 1.0077 0.9986 1.0137 1.0154 1.0317 1.0009 1.0001 1.0102 1.0108 0.9976 0.9989 1.0300 1.0286 1.0086 1.0059 0.9999 0.9981 1.0237 1.0093 1.0108 1.0197
dispcorr: -0.024398487 hartree
energy: -965.426893044253
dipole: 19.42453 -18.26065 1.16388 -7.54541 6.75771 -0.78769 -6.11897 5.74407 -0.37490
magnitude: 1.45452 au
magnitude: 3.69710 debye
