program: Gaussian 09
title: 000060691
version: EM64L-G09RevD.01
frameworkgroup: C1[X(C16H17N3)]
method: RPBEPBE
basis: SDD
operation: Freq
keyword: #pfreq=noraman
keyword: PBEPBE/SDD
title: #p freq=noraman PBEPBE/SDD
converged: YES YES NO NO
title: Mulliken charges:
elementType: N N N C C C C C C C C C C C C C C C C H H H H H H H H H H H H H H H H H
charge: -0.179409 -0.243628 -0.022080 -0.384945 0.285177 0.284007 -0.354286 -0.201158 0.463120 -0.419921 -0.340877 -0.399919 -0.678302 -0.219295 -0.320554 -0.307305 -0.244964 -0.344830 -0.337167 0.212981 0.239610 0.217584 0.222540 0.268868 0.257255 0.246815 0.238954 0.214749 0.227295 0.209793 0.228121 0.261985 0.223725 0.223589 0.234786 0.237687
chargesum: 0.00000
title: Mulliken charges with hydrogens summed into heavy atoms:
elementType: N N N C C C C C C C C C C C C C C C C
charge: -0.179409 -0.243628 -0.022080 0.067646 0.285177 0.284007 0.085838 0.067710 0.463120 -0.162666 -0.094062 -0.160965 -0.026465 0.004430 -0.092434 -0.045320 -0.021376 -0.110044 -0.099480
polarizability: 2.45837531e+02 1.17471622e+00 1.67077995e+02 -1.82628281e+00 3.82753198e+00 1.61921863e+02
1716.lowfreq: -5.0645 -0.0009 -0.0005 0.0006 3.0057 10.0455 25.1019 39.7903 47.6562
frequency: 25.0060 39.7763 47.6088 50.3423 61.7155 95.7850 168.5523 176.5250 205.9363 219.9651 222.4846 264.0548 275.9350 338.9069 353.9844 377.6124 387.2363 425.2607 483.7833 527.6512 550.6270 561.1026 584.3760 595.6551 621.1914 659.3135 688.7643 729.4034 733.9162 745.0605 752.4858 758.1809 772.4147 807.6748 815.9891 846.0110 855.8114 864.4340 868.0167 881.5002 895.5841 938.2396 944.3074 954.9719 965.3025 976.9304 1008.4799 1016.5782 1045.0542 1053.8879 1065.2554 1086.5851 1106.0304 1111.1509 1128.1737 1156.6872 1163.7027 1213.1403 1221.4538 1226.4957 1245.8257 1290.7431 1296.0852 1301.1126 1312.6338 1321.6706 1340.3545 1349.0591 1361.1677 1390.3452 1394.3093 1412.5160 1419.2998 1449.5344 1466.8219 1469.8243 1476.3261 1477.9738 1480.0211 1488.9121 1512.4145 1544.5911 1585.9753 1587.4830 1626.9025 2976.9200 2986.5526 2996.9761 3032.8694 3059.6501 3076.2682 3082.7078 3125.4196 3127.8101 3132.2191 3138.1542 3151.1774 3165.9149 3168.1400 3177.2048 3211.4372 3240.6786
redmass: 4.9303 4.4479 3.7118 4.3363 3.4941 1.7311 5.3605 4.4597 3.9442 1.5053 2.4876 3.0967 2.9975 4.3882 5.2280 3.1517 3.0123 2.8881 4.2493 3.2320 4.7191 6.1491 3.5188 5.0172 5.2611 6.9219 5.0097 1.6223 2.6280 1.1494 1.5227 5.2775 2.0200 1.5425 2.4212 1.2638 1.3351 1.4601 4.0427 1.8065 1.6166 1.3807 1.3531 7.4648 1.4455 1.3027 2.0519 2.6820 2.7166 2.1232 1.8555 2.1342 2.1305 1.9108 1.5466 1.7453 1.1416 1.8658 2.0257 1.2858 1.3818 1.1744 1.6865 1.5119 4.5811 3.6359 1.5357 2.0775 1.4706 2.5719 1.2321 3.4538 2.9033 4.0259 2.0174 1.5601 1.2190 1.3916 1.1020 1.0979 4.6384 7.3457 6.8067 5.7484 7.6996 1.0363 1.0606 1.0609 1.1000 1.1021 1.1026 1.0991 1.0887 1.0850 1.0907 1.0892 1.0954 1.1003 1.0943 1.0950 1.0912 1.1063
irintensity: 0.2554 0.1536 0.2954 0.2835 0.2165 0.0542 0.7928 1.2371 0.4158 1.7533 4.0955 0.9065 0.9363 0.3686 10.9839 2.0135 0.9764 10.1065 8.4456 10.1859 2.3111 0.2191 2.8804 4.5341 6.3738 0.6768 1.6210 16.1270 3.0723 15.2227 86.6491 9.7866 54.2499 60.8576 9.1376 3.0663 0.4689 5.8380 0.9029 15.5442 0.3950 3.2800 0.0350 15.9695 0.0784 0.0512 9.0386 20.5997 3.8484 3.2447 12.6309 16.6985 3.8819 14.5830 16.3106 4.5400 0.1793 2.3794 22.7879 23.4740 9.2718 8.2879 10.0734 1.0089 27.5548 11.1070 0.7491 28.5847 3.2037 19.5049 11.1129 10.1894 6.6130 29.9355 13.8353 8.1219 27.0565 57.4676 4.2330 22.2852 2.3650 16.6710 8.0622 331.8603 1.5082 33.1870 0.5740 46.9762 0.5624 1.3575 75.8545 36.7048 26.4343 0.2767 18.3092 6.9011 31.7043 25.5841 22.6883 3.9293 2.5960 0.8027
temp: 298.150 k
press: 1.00000 atm
elementType: 7 7 7 6 6 6 6 6 6 6 6 6 6 6 6 6 6 6 6 1 1 1 1 1 1 1 1 1 1 1 1 1 1 1 1 1
symmnumber: 1
zpe: 772608.6 jmol-1
zpe.correction: 0.294271 hartree
zpe.thermalcorrener: 0.310849 hartree
zpe.thermalcorrenthalpy: 0.311793 hartree
zpe.thermalcorrgfe: 0.248296 hartree
zpe.sumelectzpe: -782.769912 hartree
zpe.sumelectthermal: -782.753335 hartree
zpe.sumelectthermalent: -782.752390 hartree
zpe.sumelectthermalfe: -782.815887 hartree
dipole: -1.2170 4.1684 -0.2205
dipole: 4.3480
quadrupole: -117.0606 -118.6118 -105.9767
quadrupole: 16.7849 -3.5618 -0.3622
quadrupole: -3.1776 -4.7288 7.9063 16.7849 -3.5618 -0.3622
hfenergy: -783.0641835 hartree
pointgroup: C01 [X(C16H17N3)]
dipole: 0.5565757 1.6035268 0.2127248 debye
polarizability: 245.5581836|-4.7842659|167.914689|-2.0548091|-3.2919513|161.3645166 unknown
InChI: InChI=1S/C16H17N3/c1-2-12-18(15-7-10-17-11-8-15)19-13-9-14-5-3-4-6-16(14)19/h3-11,13H,2,12H2,1H3
charge 0 multiplicity 1
36 atoms
N  -0.727382 0.584583 0.177762
N  0.511335 0.415258 -0.449781
N  -3.695154 -2.478521 -0.258394
C  -0.963158 1.881957 0.852665
C  1.674438 -0.073333 0.177621
C  2.726335 -0.028242 -0.802873
C  -1.619992 2.957585 -0.045867
C  0.810971 0.761146 -1.787114
C  -1.706558 -0.414275 0.022437
C  2.15385 0.49674 -2.030229
C  1.872242 -0.53614 1.494876
C  4.023892 -0.470604 -0.43042
C  -1.859885 4.271633 0.727694
C  3.171147 -0.966434 1.835036
C  -3.025327 -0.251123 0.539809
C  -1.416919 -1.638537 -0.648367
C  4.234211 -0.933058 0.883302
C  -3.956713 -1.2970 0.377215
C  -2.425892 -2.613986 -0.755811
H  -1.585551 1.703035 1.750386
H  0.01794 2.242674 1.21131
H  -0.962751 3.148195 -0.916048
H  -2.577718 2.571594 -0.444819
H  0.029273 1.144319 -2.440127
H  2.672072 0.654485 -2.974716
H  1.049123 -0.571491 2.216043
H  4.846708 -0.452463 -1.153645
H  -0.910736 4.68907 1.112991
H  -2.323206 5.034931 0.077907
H  -2.533106 4.112072 1.591258
H  -3.33526 0.661825 1.054778
H  -0.425492 -1.826183 -1.068009
H  3.367603 -1.337593 2.846948
H  5.229647 -1.27737 1.184928
H  -4.973227 -1.184606 0.772885
H  -2.214656 -3.561044 -1.26573
