program: Orca
programVersion: 5.0.2
elementType: O O O C C C C C C C C C C C C C C C C C C C H H H H H H H H H H H H H H H H H H H H H H H H H H
charge: 0
multiplicity: 1
keywords: wb97x-d3
keywords: def2-TZVPP
keywords: def2/J RIJCOSX
keywords: DEFGRID2
keywords: scfconv7
keywords: smallprint printgap noloewdin
keywords: NOSOSCF
formula: C19H26O3
InChI: InChI=1/C19H26O3/c1-7-8-13-12(4)16(10-15(13)20)22-18(21)17-14(9-11(2)3)19(17,5)6/h7,9,14,16-17H,1,8,10H2,2-6H3
48 atoms
O  -0.370643 0.073075 0.97908
O  0.537865 -1.975285 1.089875
O  -4.792734 1.344673 1.060756
C  3.046157 -0.309535 2.033572
C  3.209857 -0.763293 0.623771
C  1.939995 -0.039442 1.024864
C  3.798369 0.913681 2.501202
C  2.858608 -1.344697 3.115703
C  4.173218 -0.127288 -0.311307
C  0.661867 -0.778578 1.042037
C  3.98057 0.028503 -1.621925
C  -1.69962 -0.44985 0.966035
C  2.733386 -0.409243 -2.328256
C  5.020932 0.66144 -2.495343
C  -2.632605 0.465456 1.747863
C  -2.252997 -0.460575 -0.438139
C  -3.434813 0.165797 -0.51438
C  -3.781089 0.747266 0.795681
C  -1.517003 -1.136444 -1.535976
C  -4.313588 0.340887 -1.712283
C  -3.846402 1.47886 -2.57064
C  -3.477023 1.366921 -3.839145
H  3.065746 -1.832119 0.483161
H  1.854563 0.994039 0.70903
H  4.804763 0.644943 2.828636
H  3.894593 1.669975 1.722257
H  3.289423 1.375021 3.349143
H  3.832129 -1.641673 3.509911
H  2.277319 -0.941379 3.947215
H  2.358423 -2.241548 2.759494
H  5.115842 0.207365 0.1131
H  -1.693788 -1.465961 1.368934
H  2.218691 0.446317 -2.774304
H  2.030984 -0.922054 -1.674346
H  2.975507 -1.087345 -3.150547
H  4.618123 1.534516 -3.015184
H  5.360031 -0.031966 -3.268984
H  5.893445 0.982165 -1.927451
H  -2.138041 1.404901 2.002716
H  -2.994809 0.028378 2.678646
H  -0.60382 -0.58686 -1.778469
H  -1.212481 -2.142583 -1.243498
H  -2.108214 -1.197116 -2.447335
H  -5.33188 0.540184 -1.36677
H  -4.351291 -0.578772 -2.300747
H  -3.813594 2.451014 -2.088457
H  -3.146401 2.223147 -4.410893
H  -3.498173 0.416247 -4.359085
totalener: -965.40594282 hartree
nucrepener: 1809.85693983 hartree
electener: -2775.26288264 hartree
oneelecener: -4905.63900081 hartree
twoeener: 2130.37611817 hartree
kineticenergy: 961.03704171 hartree
xcener: -95.137137493542 hartree
chargesum: -0.0000000
charge: -0.270635 -0.389422 -0.329979 0.128464 -0.019969 -0.109652 -0.275155 -0.259049 -0.241182 0.311524 0.000282 0.223621 -0.220798 -0.211872 -0.136556 -0.067366 -0.040794 0.222128 -0.240226 -0.117357 -0.140445 -0.220758 0.106844 0.085577 0.091898 0.085474 0.091675 0.085444 0.086716 0.101335 0.093898 0.099706 0.092343 0.063175 0.092902 0.085373 0.087665 0.079503 0.088958 0.086998 0.096969 0.122577 0.085993 0.104009 0.088632 0.119772 0.103223 0.078538
qa: -0.2706 -0.3894 -0.3300 0.1285 -0.0200 -0.1097 -0.2752 -0.2590 -0.2412 0.3115 0.0003 0.2236 -0.2208 -0.2119 -0.1366 -0.0674 -0.0408 0.2221 -0.2402 -0.1174 -0.1404 -0.2208 0.1068 0.0856 0.0919 0.0855 0.0917 0.0854 0.0867 0.1013 0.0939 0.0997 0.0923 0.0632 0.0929 0.0854 0.0877 0.0795 0.0890 0.0870 0.0970 0.1226 0.0860 0.1040 0.0886 0.1198 0.1032 0.0785
va: 2.1174 2.1056 2.1700 3.7379 3.8167 3.8093 3.9113 3.9026 3.9050 4.2320 3.7306 3.7614 3.9438 3.9430 3.8679 3.7439 3.3992 4.1289 3.9320 3.8925 3.8347 3.9578 1.0263 1.0344 1.0009 1.0046 1.0064 1.0026 1.0019 1.0198 1.0097 1.0297 0.9988 1.0181 1.0032 0.9988 0.9986 1.0097 1.0328 1.0284 1.0052 1.0079 1.0142 1.0254 1.0033 1.0100 1.0108 1.0151
dispcorr: -0.023383249 hartree
energy: -965.429326066600
dipole: 21.02037 -19.68172 1.33865 0.58617 -0.68839 -0.10222 -9.43995 8.89419 -0.54576
magnitude: 1.44924 au
magnitude: 3.68367 debye
